{"text_format":"1","workbook":"xlsx","n_sheets":9,"sheets":["Magyarázat_Fund.","OMEGA","Pontos","Munka1","Munka2","Munka3","Fund.","kötél","TeherbÍrás"],"not_rendered":{"charts":9,"images":11,"macros":1,"external_links":0,"defined_names":156,"comments":1,"pivot_tables":0},"unopened":[],"bounds":{"document_bytes":16777216,"sheet_cells":100000,"rows_first":2000,"rows_last":500,"rows_between":2000,"halvings":0,"cell_chars":16384,"cell_head_chars":4096},"cells_cut":0,"cells_raw":0,"read":"whole","date_system":"1900"}

{"sheet":"Magyarázat_Fund.","index":0,"n_rows":77,"n_cols":7,"rows_kept":77,"cut":false,"hidden":false,"merged":[]}
["A ….Fund… és a …Pont... jelzésű program (munkalap) "]
[]
["A   …Fund az EN 81 \"fundamentarista\", szó szerinti értelmezése."]
["Ez a sín szilárdsági ellenőrzésére vonatkozik."]
["Az x-irányú erők meghatározásakor a képletben osztóként szerepel a sínek száma."]
["A két sínt azonban nem azonos nagyságú vízszintes erő terheli."]
["A puttonyos vázszerkezet két főtartója és két konzola egymáshoz képest "]
["nem merev, könnyen elcsavarodhat."]
["A két konzolt különböző nagyságú függőleges erő, mint reakcióerő terheli, ezért"]
["a vízszintes erők is különböznek."]
[]
[]
[]
[]
[]
[]
[]
[]
[]
[]
[null,null,null,null,null,null,"A = B"]
[]
[null,null,null,null,null,null,"A < B"]
[]
["A terhelésre vonatkozóan a reakcióerők meghatározása:"]
[]
[null,"y = BKS/2 + yC + 1/8*TK"]
[]
[null,"B = GQ * y / BKS = GQ * (BKS/2 + yC + 1/8*TK) / BKS = "]
[null," = GQ * (4*BKS + 8*yC + TK) / 8*BKS = "]
[]
["="," GQ * [ 0,5 + yC / BKS + TK / 8*BKS]"]
[]
[null,"Terhelési tényező (az egyforma eloszláshoz tartozó 0,5 helyett):"]
[]
[null,"zQ = 0,5 + yC / BKS + TK / 8*BKS"]
[]
["A fülke önsúlya (és egyéb, rajta függő súlyok) sem egyformán terhelik a két konzolt."]
[]
[null,"Ekkor :",null,"y = BKS/2 + yS"]
{"$rows_left_out":38}
{"sheet":"OMEGA","index":1,"n_rows":66,"n_cols":11,"rows_kept":66,"cut":false,"hidden":false,"merged":[]}
[null,null,null,null,null,"Rm =",400]
[null,null,null,null,null,"l = HF / i min =",136.58000000000001]
[]
["A keresőszámok: ",null,"A karcsúsági tényező kerekített értéke:",null,null,null,{"$f":"ROUNDDOWN(G2,-1)","v":130}]
[null,null,"A maradék:",null,null,null,{"$f":"ROUND(G2-G4,0)","v":7}]
["Táblázatból:"]
["A kihajlási szám RM = 370 N/mm2 esetén:",null,null,null,null,"w 370 = ",{"$f":"VLOOKUP(G4,A15:K38,G5+2)","v":3.17}]
["A kihajlási szám RM = 520 N/mm2 esetén:",null,null,null,null,"w 520 = ",{"$f":"VLOOKUP(G4,A43:K66,G5+2)","v":4.75}]
["A kihajlási szám az adott szakítószilárdságú anyag esetén:"]
[]
[null,null,null,null,null,"w  = [(w 520 - w 370) * (RM - 370) / (520 - 370)] + w 370 = ",{"$f":"((G8-G7)*(G1-370)/150)+G7","v":3.4859999999999998}]
[]
["Az w kihajlási számok a l függvényében, RM = 370 N/mm2 esetén"]
["l",0,1,2,3,4,5,6,7,8,9]
[20,1.04,1.04,1.04,1.05,1.05,1.06,1.06,1.07,1.07,1.08]
[30,1.08,1.0900000000000001,1.0900000000000001,1.1000000000000001,1.1000000000000001,1.1100000000000001,1.1100000000000001,1.1200000000000001,1.1299999999999999,1.1299999999999999]
[40,1.1399999999999999,1.1399999999999999,1.1499999999999999,1.1599999999999999,1.1599999999999999,1.17,1.18,1.19,1.19,1.2]
[50,1.21,1.22,1.23,1.23,1.24,1.25,1.26,1.27,1.28,1.29]
[60,1.3,1.31,1.32,1.33,1.34,1.35,1.36,1.37,1.39,1.4]
[70,1.41,1.42,1.44,1.45,1.46,1.48,1.49,1.5,1.52,1.53]
[80,1.55,1.56,1.58,1.59,1.61,1.62,1.64,1.66,1.68,1.69]
[90,1.71,1.73,1.74,1.76,1.78,1.8,1.82,1.84,1.86,1.88]
[100,1.9,1.92,1.94,1.96,1.98,2,2.02,2.0499999999999998,2.0699999999999998,2.09]
[110,2.11,2.14,2.16,2.1800000000000002,2.21,2.23,2.27,2.31,2.35,2.39]
[120,2.4300000000000002,2.4700000000000002,2.5099999999999998,2.5499999999999998,2.6,2.64,2.68,2.72,2.77,2.81]
[130,2.85,2.9,2.94,2.99,3.03,3.08,3.12,3.17,3.22,3.26]
[140,3.31,3.36,3.41,3.45,3.5,3.55,3.6,3.65,3.7,3.75]
[150,3.8,3.85,3.9,3.95,4,4.0599999999999996,4.1100000000000003,4.16,4.22,4.29]
[160,4.32,4.38,4.43,4.49,4.54,4.5999999999999996,4.6500000000000004,4.71,4.7699999999999996,4.82]
[170,4.88,4.9400000000000004,5,5.05,5.1100000000000003,5.17,5.23,5.29,5.35,5.41]
[180,5.47,5.53,5.59,5.66,5.72,5.78,5.84,5.91,5.97,6.03]
[190,6.1,6.16,6.23,6.29,6.36,6.42,6.49,6.55,6.62,6.69]
[200,6.75,6.82,6.89,6.96,7.03,7.1,7.17,7.24,7.31,7.38]
[210,7.45,7.52,7.59,7.66,7.73,7.81,7.88,7.95,8.0299999999999994,8.1]
[220,8.17,8.25,8.32,8.4,8.4700000000000006,8.5500000000000007,8.6300000000000008,8.6999999999999993,8.7799999999999994,8.86]
[230,8.93,9.01,9.09,9.17,9.25,9.33,9.41,9.49,9.57,9.65]
[240,9.73,9.81,9.89,9.9700000000000006,10.050000000000001,10.14,10.220000000000001,10.3,10.39,10.47]
[250,10.55]
[]
[]
{"$rows_left_out":27}
{"sheet":"Pontos","index":2,"n_rows":1678,"n_cols":256,"rows_kept":1678,"cut":false,"hidden":false,"merged":[[281,1,282,8],[32,0,32,16383],[353,7,353,8],[612,0,613,1],[238,3,239,8],[1596,0,1597,0],[1596,2,1597,2],[1596,5,1597,5],[609,5,609,7],[1596,6,1597,6],[1436,5,1437,5],[609,0,609,1],[1451,5,1451,6],[1436,0,1437,3],[1436,4,1437,4],[1436,6,1436,8],[610,0,611,1],[609,2,609,4]]}
[null,null,null,null,null,null,null,null,null,null,null,"FEL",null,null,null,null,null,null,null,null,null,null,null,null,1,null,null,null,null,null,null,null,null,null,null,null,null,null,null,null,null,null,null,null,null,null,null,null,null,1]
[null,null,null,null,null,null,null,null,null,null,null,null,null,null,null,null,null,null,null,null,null,null,null,null,2,null,null,null,null,null,null,null,null,null,null,null,null,null,null,null,null,"-",null,null,null,null,null,null,null,2]
[null,null,null,null,null,null,null,null,null,null,null,null,null,null,null,null,null,null,null,null,null,null,null,null,3,null,null,null,null,null,null,null,null,null,null,null,null,null,null,null,null,null,null,null,null,null,null,null,null,3]
[null,null,null,null,null,null,null,null,null,null,null,null,null,null,null,null,null,null,null,null,null,null,null,null,4,null,null,null,null,null,null,null,null,null,null,null,null,null,null,null,null,null,null,null,null,null,null,null,null,4]
[null,null,null,null,null,null,null,null,null,null,null,null,null,null,null,null,null,null,null,null,null,null,null,null,5,null,null,null,null,null,null,null,null,null,null,null,null,null,null,null,null,null,null,null,null,null,null,null,null,5]
[1,2,3,4,5,6,7,8,9,10,11,null,13,14,15,16,17,18,19,20,21,22,23,24,6,null,null,null,29,30,31,32,33,34,35,36,37,38,39,40,16,17,18,19,20,21,22,23,24,6]
["Beépítési hely:",null,null,"Xxxx",null,null,null,null,null,null,null,null,null,0,0,0,0,0,0,null,null,null,null,null,7,null,null,null,null,null,null,null,null,null,null,null,null,null,null,null,null,null,null,null,null,null,null,null,null,7]
["Terhelési- és egyéb adatok:",null,null,null,null,null,null,null,null,null,null,null,null,0,0,0,0,0,0,null,null,null,null,null,8,null,null,null,null,null,null,null,null,null,null,null,null,null,null,null,null,"mm",null,null,null,null,null,null,null,8]
["Teherbírás:",null,null,null,null,"GQ =",1125,"kg",0,12,null,null,null,0,0,0,0,0,0,null,null,null,null,null,9,null,null,null,null,null,null,null,null,null,{"$f":"ROUND(GQ/75,0)","v":15},"személy",null,null,null,null,null,null,null,null,null,null,null,null,null,9]
["Ha a rakodógép behajt a fülkébe, annak tömege:",null,null,null,null,"GT =",0,"kg","GQr",null,null,null,null,0,0,0,0,0,0,null,null,null,null,null,10,null,null,null,null,null,null,null,null,null,null,null,null,null,null,null,null,"mm",null,null,null,null,null,null,null,10]
["Névleges sebesség:",null,null,null,null,"VKN =",1,"m/s",null,null,null,null,null,0,0,0,0,0,0,null,null,null,null,null,11,null,null,null,null,null,null,null,null,null,null,null,null,null,null,null,null,null,null,null,null,null,null,null,null,11]
["Összes megállók száma",null,null,null,null,"Nö=",6,"db",null,7,null,null,null,0,0,0,0,0,0,null,null,null,null,null,12,null,null,null,null,null,null,null,null,null,2,12,null,null,null,null,null,null,null,null,null,null,null,null,null,12]
[null,"A haladási megállók száma",null,null,null,"Nh=",7,"db",null,null,null,null,null,0,0,0,0,0,0,null,null,null,null,null,13,null,null,null,null,null,null,null,null,null,null,null,"FEL",null,null,null,null,null,null,null,null,null,null,null,null,13]
["Az óránkénti indítások száma:",null,null,null,null,"ZKH =",240,"1/h",null,null,null,null,null,0,0,0,0,0,0,null,null,null,null,null,14,null,null,null,null,null,null,null,null,null,null,null,null,null,null,null,null,null,null,null,null,null,null,null,null,14]
["Emelési magasság (max. 42,0 m): ",null,null,null,null,"HQ =",24,"m",null,null,null,null,null,null,null,null,null,null,null,null,null,null,null,null,15,null,null,null,null,null,null,null,null,null,null,null,null,"HI=",0,null,null,null,null,null,null,null,null,null,null,15]
["Süllyeszték mélysége:",null,null,null,null,"HSG =",1.4,"m",null,null,null,null,null,0,0,0,0,0,0,null,null,null,null,null,16,null,null,null,null,null,null,null,null,null,null,null,null,null,null,null,null,null,null,null,null,null,null,null,null,16]
["Fejmagasság:",null,null,null,null,"HSK =",3.72,"m",null,null,null,null,null,0,0,0,0,0,0,null,null,null,null,null,17,null,null,null,null,null,null,null,null,null,null,null,null,null,null,null,null,null,null,null,null,null,null,null,null,17]
["Aknamagasság:",null,null,null,null,"HS =",{"$f":"G15+G16+G17","v":29.119999999999997},"m",null,null,null,null,null,0,0,0,0,0,0,null,null,null,null,null,18,null,null,null,null,null,null,null,null,null,null,null,null,null,null,null,null,null,null,null,null,null,null,null,null,18]
["Fülke tömege:",null,null,null,"GK =",750,720,"kg",null,null,null,null,null,0,0,0,0,0,0,null,null,null,null,null,19,null,null,null,null,null,null,null,null,null,"GKr",810,null,null,null,null,null,null,null,null,null,null,null,null,null,19]
["Kiegyenlítési tényező:",null,null,null,null,"KG =",0.5,"-",null,null,null,null,null,0,0,0,0,0,0,null,null,null,null,null,20,null,null,null,null,null,null,null,null,null,"GGr",{"$f":"KG*GQr+GKr+(NKk*GR+NGk*GR)","v":810},null,null,null,null,null,null,null,null,null,null,null,null,null,20]
["Ellensúly tömege:",null,null,null,"GG = KG*GQ + GK  =",{"$f":"KG*GQ+GK","v":1282.5},{"$f":"IF(KZU>1,F21+(NGk*GRE),F21)","v":1282.5},"kg",null,null,null,null,null,0,0,0,0,0,0,null,null,null,null,null,21,null,null,null,null,null,null,null,null,null,null,null,null,null,null,null,null,null,null,null,null,null,null,null,null,21]
["Hajtómű tömege:",null,null,null,null,"GW =",433,"kg",null,null,null,null,null,0,0,0,0,0,0,null,null,null,null,null,22,null,null,null,null,null,null,null,null,null,null,null,null,null,null,null,null,null,null,null,null,null,null,null,null,22]
["Géptartó gerenda tömege:",null,null,null,null,"GWR=",65,"kg",null,null,null,null,null,0,0,0,0,0,0,null,null,null,null,null,23,null,null,null,null,null,null,null,null,null,null,null,"LE",null,null,null,null,null,null,null,null,null,null,null,null,23]
["Hajtótárcsa tömege:",null,null,null,null,"GD =",50,"kg",null,null,null,null,null,null,null,null,null,null,null,null,null,null,null,null,24,null,null,null,null,null,null,null,null,null,null,null,null,null,null,null,null,null,null,null,null,null,null,null,null,24]
["A függesztőkötél névleges átmérője:",null,null,null,null,"DZ = ",9,"mm",null,null,null,null,null,null,null,null,null,null,null,null,null,null,null,null,25,null,null,null,null,null,null,null,null,null,null,null,null,null,null,null,null,null,null,null,null,null,null,null,null,25]
["Kötélszerkezet:",null,{"$f":"VLOOKUP(DZ,kötél!A1:M24,2)","v":"Seale"},null,null,null,1.0942407831712657,null,null,null,null,null,null,null,null,null,null,null,null,null,null,null,null,null,26,null,null,null,null,null,null,null,null,null,4,null,null,null,"LE",null,null,null,null,null,null,null,null,null,null,26]
["A függesztőkötél darabszáma:",null,null,null,null,"ZZ = ",4,"db",null,null,null,"FZ120",null,null,null,null,null,null,null,null,null,null,null,null,27,null,null,null,null,null,null,null,null,null,null,null,"FZ120",null,"F120( Fülke)",0]
[null,null,null,null,null,"GZM1 =",{"$f":"VLOOKUP(DZ,kötél!D2:M24,10)","v":0.28999999999999998},"kg/m",null,null,null,"FZ220",null,null,null,null,null,null,null,null,null,null,null,null,28,null,null,null,null,null,null,null,null,null,null,{"$f":"LN(AN27/AN28)*0.2","v":{"$error":"#DIV/0!"}},"FZ220",null,"F220 (Ellensúly)",0]
[null,null,null,null,null,"sB  =",1570,"N/mm2",null,null,null,null,null,null,null,null,null,null,null,null,null,null,null,null,29,null,null,null,null,null,null,null,null,null,null,null,null,null,"GQr"]
["Egy kötél min. szakítóereje:",null,null,null,null,"FZM =",{"$f":"VLOOKUP(DZ,kötél!D2:M24,9)*1000","v":37300},"N ",null,null,null,null,null,null,null,null,null,null,null,null,null,null,null,null,30,null,null,null,null,null,null,null,null,null,null,null,null,null,"számított e"]
["Hajómű és keréktárcsa távolsága (Csak alsógép esetén)",null,null,null,null,"HHKf=",0,"m",null,null,null,null,null,null,null,null,null,null,null,null,null,null,null,null,null,null,null,null,null,null,null,null,null,null,null,null,null,null,"emZRN*bD"]
["Hajómű és keréktárcsa távolsága (Csak alsógép esetén)",null,null,null,null,"HHKe=",24,"m",null,null,null,null,null,null,null,null,null,null,null,null,null,null,null,null,null,null,null,null,null,null,null,null,null,null,null,null,null,null,"K1"]
["Fülke/ellensúly helyzet távolsága az emelési magasság közepétől (y=HQ/2)="]
[null,null,null,null,"Fülke fel","y_fel=",0,"m",null,null,null,null,null,null,null,null,null,null,null,null,null,null,null,null,null,null,null,null,null,null,null,null,null,null,null,null,null,null,"S=F120-F220"]
[null,null,null,null,"Fülke le","y_le=",24,"m",null,null,null,null,null,null,null,null,null,null,null,null,null,null,null,null,null,null,null,null,null,null,null,null,null,null,null,null,null,null,"N=abs(S)/μZRN",{"$f":"ABS(AN34)/VLOOKUP(HOR,$A$261:$H$265,8)","v":0},0,0,0,0,0,0,0,0,0,null,0,0,0,{"$f":"ABS(BB34)/VLOOKUP(HOR,$A$261:$H$265,8)","v":0},0,0,0,0,0]
["Függesztő kötél kiegyenlítetlen hosszának tömege:",null,null,null,null,null,null,null,null,null,null,null,null,null,null,null,null,null,null,null,null,null,null,null,null,null,null,null,null,null,null,null,null,null,null,null,null,"surlódási kúpszög=","tan(S/N)",{"$f":"DEGREES(TAN(ABS(AN34)/AN35))","v":{"$error":"#DIV/0!"}},{"$f":"DEGREES(TAN(ABS(AO34)/AO35))","v":{"$error":"#DIV/0!"}},{"$error":"#DIV/0!"},{"$error":"#DIV/0!"},{"$error":"#DIV/0!"},{"$error":"#DIV/0!"},{"$error":"#DIV/0!"},{"$error":"#DIV/0!"},{"$error":"#DIV/0!"},{"$error":"#DIV/0!"},{"$error":"#DIV/0!"},0,0,0,{"$f":"DEGREES(TAN(ABS(BB34)/BB35))","v":{"$error":"#DIV/0!"}},{"$error":"#DIV/0!"},{"$error":"#DIV/0!"},{"$error":"#DIV/0!"},{"$error":"#DIV/0!"},{"$error":"#DIV/0!"}]
["Fülke oldal:",null,null,null,null,"GZf1 = GZM1 * ZZ *HQ/2+/-y) =",{"$f":"_GZM1*ZZ*y_fel","v":0},"kg",null,null,null,null,null,null,null,null,null,null,null,null,null,null,null,null,null,null,null,null,null,null,null,null,null,null,null,null,null,null,"ln(F120/F220)/μ=β",205.56343863121648,207.5516297088829,209.5448151767894,211.54297496537316,213.54620070932833,215.55454763593221,217.56810835303338,219.58686587855306,221.61091421991364,224.04686708090003,224.04686708090003,0,0]
["Ellensúly oldal:",null,null,null,null,"GZe2=",{"$f":"_GZM1*ZZ*y_le","v":27.839999999999996},"kg",null,null,null,null,null,null,null,null,null,null,null,null,null,null,null,null,null,null,null,null,null,null,null,null,null,null,null,null,"y_fel",null,"Horony nyomás",{"$f":"$G$322","v":{"$error":"#DIV/0!"}},{"$f":"$G$321","v":{"$error":"#DIV/0!"}},"N/mm2",null,null,null,null,null,null,null,null,0,0]
["Alsógép. A fülke oldalon",null,null,null,"GZAf=GZM'*ZZ*HHKf",null,{"$f":"_GZM1*ZZ*HHKf","v":0},"kg",null,null,null,24,null,null,null,null,null,null,null,null,null,null,null,null,null,null,null,null,null,null,null,null,null,null,null,null,25.5,null,"Kötélsúly",null,null,null,null,null,null,null,null,null,null,null,0,0]
["Alsógép az ellensúly oldalon",null,null,null,"GZAe=GZM'*ZZ*HHKe",null,{"$f":"_GZM1*ZZ*HHKe","v":27.839999999999996},"kg",null,null,null,null,null,null,null,null,null,null,null,null,null,null,null,null,null,null,null,null,null,null,null,null,null,null,null,null,null,null,"Motor telj (kW)",{"$f":"(ABS(AN34)*VKN)/(1000*0.98*0.85)","v":0},0,0,0,0,0,0,0,0,0,0,0,0,{"$f":"(ABS(BA34)*VKN)/(1000*0.98*0.85)","v":0},0,0,0,0,0,0]
{"$rows_left_out":1639}
{"sheet":"Munka1","index":3,"n_rows":0,"n_cols":0,"rows_kept":0,"cut":false,"hidden":false,"merged":[]}

{"sheet":"Munka2","index":4,"n_rows":0,"n_cols":0,"rows_kept":0,"cut":false,"hidden":false,"merged":[]}

{"sheet":"Munka3","index":5,"n_rows":0,"n_cols":0,"rows_kept":0,"cut":false,"hidden":false,"merged":[]}

{"sheet":"Fund.","index":6,"n_rows":1670,"n_cols":10,"rows_kept":1670,"cut":false,"hidden":false,"merged":[[1428,5,1429,5],[1443,5,1443,6],[1588,0,1589,0],[1588,2,1589,2],[1588,5,1589,5],[1588,6,1589,6],[297,0,297,1],[297,2,297,4],[297,5,297,7],[1428,6,1428,8],[298,0,299,1],[300,0,301,1],[348,5,349,8],[350,5,351,8],[361,4,363,8],[601,0,601,1],[601,2,601,4],[601,5,601,7],[602,0,603,1],[604,0,605,1],[1428,0,1429,3],[1428,4,1429,4],[136,4,136,5],[138,4,138,5],[139,4,139,5],[180,3,181,8],[225,1,227,6],[97,0,98,6],[100,0,101,6],[110,1,110,8],[134,4,134,5],[135,4,135,5]]}
[]
[]
[]
[]
[]
[]
["Beépítési hely:",null,null,"Xxxx"]
["Terhelési- és egyéb adatok:"]
["Teherbírás:",null,null,null,null,"GQ =",1025,"kg"]
["Ha a rakodógép behajt a fülkébe, annak tömege:",null,null,null,null,"GT =",0,"kg"]
["Névleges sebesség:",null,null,null,null,"VKN =",1,"m/s"]
["Függesztési tényező:",null,null,null,null,"KZU =",2,"-"]
["Az óránkénti indítások száma:",null,null,null,null,"ZKH =",180,"1/h"]
["Emelési magasság (max. 42,0 m): ",null,null,null,null,"HQ =",15,"m"]
["Süllyeszték mélysége:",null,null,null,null,"HSG =",1.2,"m"]
["Fejmagasság:",null,null,null,null,"HSK =",3.7,"m"]
["Aknamagasság:",null,null,null,null,"HS =",{"$f":"+G14+G15+G16","v":19.899999999999999},"m"]
["Fülke tömege:",null,null,null,null,"GK =",1100,"kg"]
["Kiegyenlítési tényező:",null,null,null,null,"KG =",0.5,"-"]
["Ellensúly tömege:",null,null,null,null,"GG = KG*GQ + GK  =",{"$f":"G19*G9+G18","v":1612.5},"kg"]
["Hajtómű tömege:",null,null,null,null,"GW =",250,"kg"]
["Géptartó gerenda tömege:",null,null,null,null,"GWR=",60,"kg"]
["Hajtótárcsa tömege:",null,null,null,null,"GD =",58,"kg"]
["A függesztőkötél névleges átmérője:",null,null,null,null,"DZ = ",11,"mm"]
["Kötélszerkezet:",null," SEALE + 8,0 B 1570 RF 8 x 19  nyolcpászmás acélsodronykötél."]
["A függesztőkötél darabszáma:",null,null,null,null,"ZZ = ",4,"db"]
["Egy kötél tömege méterenként:",null,null,null,null,"GZM1 =",0.22,"kg/m"]
["A kötél anyagának szakítószilárdsága:",null,null,null,null,"sB  =",1570,"N/mm2"]
["Egy kötél min. szakítóereje:",null,null,null,null,"FZM =",57400,"N "]
["Függesztő kötél kiegyenlítetlen hosszának tömege:"]
[null,null,null,null,null,"GZ = GZM1 * ZZ * HQ =",{"$f":"G14*G26*G27","v":13.2},"kg"]
["Függesztő kötél teljes hosszának tömege:"]
[null,null,null,null,null,"GZS ~= GZM1 * ZZ * (HS + HSK) * KZU =",{"$f":"(G17+G16)*G26*G27*G12","v":41.535999999999994},"kg"]
["A kiegyenlítőlánc javasolt folyóméter-tömege:",null,null,null,null,"GUMJ = ",{"$f":"G26*G27*G12","v":1.76},"kg"]
["Kiegyenlítő lánc tömege méterenként:",null,null,null,null,"GUM =",0,"kg/m"]
["Kiegyenlítő lánc tömege:",null,null,null,null,"GU = GUM * HQ =",{"$f":"G35*G14","v":0},"kg"]
["Függőkábel folyóméterenkénti tömege:",null,null,null,null,"GHM =",1.25,"kg/m"]
["Függőkábel tömege:",null,null,null,null,"GH = GHM * HQ/2 =",{"$f":"+G14*G37/2","v":9.375},"kg"]
["A hajtótárcsa névleges (közép) átmérője:",null,null,null,null,"DD =",570,"mm"]
["A hajtótárcsa horonykivitele: ",null,null,null,null,null,3,null,{"$f":"IF( OR(G40<1,G40>3),\"Helytelen adat!\",\" \")","v":" "}]
{"$rows_left_out":1631}
{"sheet":"kötél","index":7,"n_rows":24,"n_cols":13,"rows_kept":24,"cut":false,"hidden":false,"merged":[]}
["kötélazonositó","kötélszerkezet","sodrastipus","kötélátméro","pasznaszam","kötélszakitószilárdság","sodrsirany","betetfajta","meret","feluletkezeles","számitottszakitóero","minimálisszakitoero","kötélfmsúly"]
[20,"NINCS","",0,"",0,"","","","",0,0,0]
[21,"Acélbetétes gumi v. poliuretán_SMT-PV30","",1.73,"",1770,"","",12,"",0,42,0.25]
[17,"Acélbetétes gumi v. poliuretán_SMT-PV40","","1.73x16","",1770,"","",16,"",0,56,0.33]
[22,"Acélbetétes gumi v. poliuretán_ SMT-PV50","","1.73x20","",1770,"","",20,"",0,70,0.42]
[23,"Acélbetétes gumi v. poliuretán_SMT-PV60","","1.73x24","",0,"","",24,"",0,84,0.5]
[4,"Seale","+",6,"H",1570,"J","K","6x19","-",21.7,18.899999999999999,0.13]
[14,"Seale","+",6.5,"B",1770,"J","F","6x19","-",26.7,23.5,0.154]
[19,"PAWO","",6.5,"",0,"","","","",31.5,23.5,0.17]
[15,"DRAKO 250T","+",8,"",1570,"J","F","8x19","-",49.4,38.799999999999997,0.27]
[1,"Seale","+",8,"B",1770,"J","K","8x19","ZN",35.299999999999997,30.4,0.22]
[5,"Seale","+",8,"B",1570,"J","F","8x19","-",33,28.21,0.22]
[6,"Seale","+",9,"B",1570,"J","F","8x19","-",43.4,37.299999999999997,0.28999999999999998]
[18,"DRAKO 250T","+",10,"",1570,"J","F","8x19","-",60.6,52.845999999999997,0.42]
[2,"Seale","+",10,"B",1570,"J","F","8x19","-",55.1,52.845999999999997,0.36]
[16,"DRAKO 250T","+",11,"B",1570,"J","K","8x19","-",95.7,75.099999999999994,0.51200000000000001]
[3,"Seale","+",11,"B",1570,"J","F","8x19","-",66.7,57.4,0.40699999999999997]
[13,"Saele","+",12,"B",1570,"J","F","8x19","-",79.5,68.400000000000006,0.48499999999999999]
[7,"Seale","+",13,"B",1570,"J","F","8x19","-",93.1,80,0.56899999999999995]
[8,"Seale","+",15,"B",1570,"J","F","8x19","-",121,104,0.78]
[9,"Seale","+",15.5,"B",1570,"J","F","8x19","-",129,111,0.81]
[10,"Seale","+",16,"B",1570,"J","F","8x19","-",131.5,113,0.88]
[11,"Seale","+",17,"B",1570,"J","F","8x19","-",154.5,133,0.98]
[12,"Seale","+",19,"B",1570,"J","F","8x19","-",0,159,1.24]

{"sheet":"TeherbÍrás","index":8,"n_rows":63,"n_cols":3,"rows_kept":63,"cut":false,"hidden":false,"merged":[]}
["teherbirás","személyekszáma","felvonotipus"]
[1350,0,"17,22,126,"]
[100,0,"17,22,28,29,"]
[225,3,"28,47,55,"]
[230,0,"92,"]
[250,0,"4,17,22,28,"]
[300,4,"4,17,22,28,35,55,92,51,"]
[320,4,"10,22,28,29,37,47,51,64,65,92,"]
[375,5,"22,47,63,28,"]
[385,0,"82,"]
[400,5,"8,9,12,22,23,28,29,32,44,47,56,31,"]
[430,5,"4,"]
[450,6,"10,11,13,14,15,16,22,23,12,28,29,37,46,47,53,31,51,1,"]
[475,0,"23,"]
[480,6,"12,22,28,29,32,47,1,"]
[500,0,"22,28,47,73,"]
[525,0,"22,"]
[535,7,"8,9,12,23,47,"]
[550,7,"10,11,"]
[600,8,"28,28,86,51,"]
[625,8,"8,9,12,13,"]
[630,8,"1,10,11,12,13,14,15,22,16,23,28,29,31,32,33,36,44,45,47,51,37,76,33,28,48,69,83,49,42,88,97,113,114,118,122,125,93,8,9,127,"]
[650,8,"28,"]
[675,9,"8,9,12,23,47,29,127,"]
[680,9,"123,"]
[750,10,"22,28,51,23,"]
[800,10,"8,9,10,11,12,13,14,15,16,33,36,28,47,49,93,104,112,23,"]
[825,0,"22,"]
[850,11,"22,28,29,51"]
[900,12,"8,9,10,11,22,23,28,29,41,47,121,51n"]
[1000,13,"3,9,8,10,11,12,13,14,15,22,23,16,28,29,31,32,33,40,42,43,47,49,60,69,48,85,88,49,93,98,51,105,110,24,"]
[1020,13,"31,47,"]
[1050,14,"22,28,28,69,"]
[1075,14,"22,49,"]
[1125,15,"8,9,23,"]
[1150,15,"28,38,32,"]
[1200,16,"22,59,69,51,"]
[1250,16,"22,28,47,58,49"]
[1275,17,"12,23,14,15,22,18,28,29,33,31,93,24,"]
[1425,0,"22,"]
{"$rows_left_out":23}