{"text_format":"1","workbook":"xlsx","n_sheets":9,"sheets":["Magyarázat_Fund.","OMEGA","Pontos","Munka1","Munka2","Munka3","Fund.","kötél","TeherbÍrás"],"not_rendered":{"charts":9,"images":11,"macros":1,"external_links":0,"defined_names":156,"comments":1,"pivot_tables":0},"unopened":[],"bounds":{"document_bytes":16777216,"sheet_cells":100000,"rows_first":2000,"rows_last":500,"rows_between":2000,"halvings":0,"cell_chars":16384,"cell_head_chars":4096},"cells_cut":0,"cells_raw":0,"read":"whole","date_system":"1900"}

{"sheet":"Magyarázat_Fund.","index":0,"n_rows":77,"n_cols":7,"rows_kept":77,"cut":false,"hidden":false,"merged":[]}
["A ….Fund… és a …Pont... jelzésű program (munkalap) "]
[]
["A   …Fund az EN 81 \"fundamentarista\", szó szerinti értelmezése."]
["Ez a sín szilárdsági ellenőrzésére vonatkozik."]
["Az x-irányú erők meghatározásakor a képletben osztóként szerepel a sínek száma."]
["A két sínt azonban nem azonos nagyságú vízszintes erő terheli."]
["A puttonyos vázszerkezet két főtartója és két konzola egymáshoz képest "]
["nem merev, könnyen elcsavarodhat."]
["A két konzolt különböző nagyságú függőleges erő, mint reakcióerő terheli, ezért"]
["a vízszintes erők is különböznek."]
[]
[]
[]
[]
[]
[]
[]
[]
[]
[]
[null,null,null,null,null,null,"A = B"]
[]
[null,null,null,null,null,null,"A < B"]
[]
["A terhelésre vonatkozóan a reakcióerők meghatározása:"]
[]
[null,"y = BKS/2 + yC + 1/8*TK"]
[]
[null,"B = GQ * y / BKS = GQ * (BKS/2 + yC + 1/8*TK) / BKS = "]
[null," = GQ * (4*BKS + 8*yC + TK) / 8*BKS = "]
[]
["="," GQ * [ 0,5 + yC / BKS + TK / 8*BKS]"]
[]
[null,"Terhelési tényező (az egyforma eloszláshoz tartozó 0,5 helyett):"]
[]
[null,"zQ = 0,5 + yC / BKS + TK / 8*BKS"]
[]
["A fülke önsúlya (és egyéb, rajta függő súlyok) sem egyformán terhelik a két konzolt."]
[]
[null,"Ekkor :",null,"y = BKS/2 + yS"]
[]
[null,"B = GK * y / BKS = GK * (BKS/2 + yS) / BKS = GK * (0,5 + yS / BKS)"]
[]
[null,"A terhelési tényező (az egyforma eloszláshoz tartozó 0,5 helyett):"]
[]
[null,"zK = 0,5 + yS / BKS"]
[]
["Hasonló képpen a küszöbterhelésre vonatkozóan:"]
[]
[]
[]
[]
[]
[]
[]
[]
[]
[]
[]
[]
[]
[]
[]
[]
[]
[null,"B = Fw * [ (yw + BKS / 2) + GK * (yS + BKS / 2)] / BKS"]
[]
[null,"a terhelési tényező a küszöbterhelésre vonatkozóan 0,5 helyett:"]
[]
[null,"zw = 0,5 + yw / BKS"]
[]
[null,"a fülkesúlyra vonatkozóan azonos az előzővel."]
[]
["Az EN 81 és a …Fund… program ezeket nem veszi figyelembe, hanem a két sínre "]
["egyforma terhelést feltételez."]
[]
["A …Pont… program (munkalap) a fenti, egyenlőtlen eloszlást figyelembe veszi."]

{"sheet":"OMEGA","index":1,"n_rows":66,"n_cols":11,"rows_kept":66,"cut":false,"hidden":false,"merged":[]}
[null,null,null,null,null,"Rm =",400]
[null,null,null,null,null,"l = HF / i min =",136.58000000000001]
[]
["A keresőszámok: ",null,"A karcsúsági tényező kerekített értéke:",null,null,null,{"$f":"ROUNDDOWN(G2,-1)","v":130}]
[null,null,"A maradék:",null,null,null,{"$f":"ROUND(G2-G4,0)","v":7}]
["Táblázatból:"]
["A kihajlási szám RM = 370 N/mm2 esetén:",null,null,null,null,"w 370 = ",{"$f":"VLOOKUP(G4,A15:K38,G5+2)","v":3.17}]
["A kihajlási szám RM = 520 N/mm2 esetén:",null,null,null,null,"w 520 = ",{"$f":"VLOOKUP(G4,A43:K66,G5+2)","v":4.75}]
["A kihajlási szám az adott szakítószilárdságú anyag esetén:"]
[]
[null,null,null,null,null,"w  = [(w 520 - w 370) * (RM - 370) / (520 - 370)] + w 370 = ",{"$f":"((G8-G7)*(G1-370)/150)+G7","v":3.4859999999999998}]
[]
["Az w kihajlási számok a l függvényében, RM = 370 N/mm2 esetén"]
["l",0,1,2,3,4,5,6,7,8,9]
[20,1.04,1.04,1.04,1.05,1.05,1.06,1.06,1.07,1.07,1.08]
[30,1.08,1.0900000000000001,1.0900000000000001,1.1000000000000001,1.1000000000000001,1.1100000000000001,1.1100000000000001,1.1200000000000001,1.1299999999999999,1.1299999999999999]
[40,1.1399999999999999,1.1399999999999999,1.1499999999999999,1.1599999999999999,1.1599999999999999,1.17,1.18,1.19,1.19,1.2]
[50,1.21,1.22,1.23,1.23,1.24,1.25,1.26,1.27,1.28,1.29]
[60,1.3,1.31,1.32,1.33,1.34,1.35,1.36,1.37,1.39,1.4]
[70,1.41,1.42,1.44,1.45,1.46,1.48,1.49,1.5,1.52,1.53]
[80,1.55,1.56,1.58,1.59,1.61,1.62,1.64,1.66,1.68,1.69]
[90,1.71,1.73,1.74,1.76,1.78,1.8,1.82,1.84,1.86,1.88]
[100,1.9,1.92,1.94,1.96,1.98,2,2.02,2.0499999999999998,2.0699999999999998,2.09]
[110,2.11,2.14,2.16,2.1800000000000002,2.21,2.23,2.27,2.31,2.35,2.39]
[120,2.4300000000000002,2.4700000000000002,2.5099999999999998,2.5499999999999998,2.6,2.64,2.68,2.72,2.77,2.81]
[130,2.85,2.9,2.94,2.99,3.03,3.08,3.12,3.17,3.22,3.26]
[140,3.31,3.36,3.41,3.45,3.5,3.55,3.6,3.65,3.7,3.75]
[150,3.8,3.85,3.9,3.95,4,4.0599999999999996,4.1100000000000003,4.16,4.22,4.29]
[160,4.32,4.38,4.43,4.49,4.54,4.5999999999999996,4.6500000000000004,4.71,4.7699999999999996,4.82]
[170,4.88,4.9400000000000004,5,5.05,5.1100000000000003,5.17,5.23,5.29,5.35,5.41]
[180,5.47,5.53,5.59,5.66,5.72,5.78,5.84,5.91,5.97,6.03]
[190,6.1,6.16,6.23,6.29,6.36,6.42,6.49,6.55,6.62,6.69]
[200,6.75,6.82,6.89,6.96,7.03,7.1,7.17,7.24,7.31,7.38]
[210,7.45,7.52,7.59,7.66,7.73,7.81,7.88,7.95,8.0299999999999994,8.1]
[220,8.17,8.25,8.32,8.4,8.4700000000000006,8.5500000000000007,8.6300000000000008,8.6999999999999993,8.7799999999999994,8.86]
[230,8.93,9.01,9.09,9.17,9.25,9.33,9.41,9.49,9.57,9.65]
[240,9.73,9.81,9.89,9.9700000000000006,10.050000000000001,10.14,10.220000000000001,10.3,10.39,10.47]
[250,10.55]
[]
[]
["Az w kihajlási számok a l függvényében, RM = 520 N/mm2 esetén"]
["l",0,1,2,3,4,5,6,7,8,9]
[20,1.06,1.06,1.07,1.07,1.08,1.08,1.0900000000000001,1.0900000000000001,1.1000000000000001,1.1100000000000001]
[30,1.1100000000000001,1.1200000000000001,1.1200000000000001,1.1299999999999999,1.1399999999999999,1.1499999999999999,1.1499999999999999,1.1599999999999999,1.17,1.18]
[40,1.19,1.19,1.2,1.21,1.22,1.23,1.24,1.25,1.26,1.27]
[50,1.28,1.3,1.31,1.32,1.33,1.35,1.36,1.37,1.39,1.4]
[60,1.41,1.43,1.44,1.46,1.48,1.49,1.51,1.53,1.54,1.56]
[70,1.58,1.6,1.62,1.64,1.66,1.68,1.7,1.72,1.74,1.77]
[80,1.79,1.81,1.83,1.86,1.88,1.91,1.93,1.95,1.98,2.0099999999999998]
[90,2.0499999999999998,2.1,2.1,2.19,2.2400000000000002,2.29,2.33,2.38,2.4300000000000002,2.48]
[100,2.5299999999999998,2.58,2.64,2.69,2.74,2.79,2.85,2.9,2.95,3.01]
[110,3.06,3.12,3.18,3.23,3.29,3.35,3.41,3.47,3.53,3.59]
[120,3.65,3.71,3.77,3.83,3.89,3.96,4.0199999999999996,4.09,4.1500000000000004,4.22]
[130,4.28,4.3499999999999996,4.41,4.4800000000000004,4.55,4.62,4.6900000000000004,4.75,4.82,4.8899999999999997]
[140,4.96,5.04,5.1100000000000003,5.18,5.25,5.33,5.4,5.47,5.55,5.62]
[150,5.7,5.78,5.85,5.93,6.01,6.09,6.16,6.24,6.32,6.4]
[160,6.48,6.57,6.65,6.73,6.81,6.9,6.98,7.06,7.15,7.23]
[170,7.32,7.41,7.49,7.58,7.67,7.76,7.85,7.94,8.0299999999999994,8.1199999999999992]
[180,8.2100000000000009,8.3000000000000007,8.39,8.43,8.58,8.67,8.76,8.86,8.9499999999999993,9.0500000000000007]
[190,9.14,9.24,9.34,9.44,9.5299999999999994,9.6300000000000008,9.73,9.83,9.93,10.029999999999999]
[200,10.130000000000001,10.23,10.34,10.44,10.54,10.65,10.75,10.85,10.96,11.06]
[210,11.17,11.28,11.38,11.49,11.6,11.71,11.82,11.93,12.04,12.15]
[220,12.26,12.37,12.48,12.6,12.71,12.82,12.94,13.05,13.17,13.28]
[230,13.4,13.52,13.63,13.75,13.87,13.99,14.11,14.23,14.35,14.47]
[240,14.59,14.71,14.83,14.96,15.08,15.2,15.33,15.45,15.58,15.71]
[250,15.83]

{"sheet":"Pontos","index":2,"n_rows":1678,"n_cols":256,"rows_kept":1678,"cut":false,"hidden":false,"merged":[[281,1,282,8],[32,0,32,16383],[353,7,353,8],[612,0,613,1],[238,3,239,8],[1596,0,1597,0],[1596,2,1597,2],[1596,5,1597,5],[609,5,609,7],[1596,6,1597,6],[1436,5,1437,5],[609,0,609,1],[1451,5,1451,6],[1436,0,1437,3],[1436,4,1437,4],[1436,6,1436,8],[610,0,611,1],[609,2,609,4]]}
[null,null,null,null,null,null,null,null,null,null,null,"FEL",null,null,null,null,null,null,null,null,null,null,null,null,1,null,null,null,null,null,null,null,null,null,null,null,null,null,null,null,null,null,null,null,null,null,null,null,null,1]
[null,null,null,null,null,null,null,null,null,null,null,null,null,null,null,null,null,null,null,null,null,null,null,null,2,null,null,null,null,null,null,null,null,null,null,null,null,null,null,null,null,"-",null,null,null,null,null,null,null,2]
[null,null,null,null,null,null,null,null,null,null,null,null,null,null,null,null,null,null,null,null,null,null,null,null,3,null,null,null,null,null,null,null,null,null,null,null,null,null,null,null,null,null,null,null,null,null,null,null,null,3]
[null,null,null,null,null,null,null,null,null,null,null,null,null,null,null,null,null,null,null,null,null,null,null,null,4,null,null,null,null,null,null,null,null,null,null,null,null,null,null,null,null,null,null,null,null,null,null,null,null,4]
[null,null,null,null,null,null,null,null,null,null,null,null,null,null,null,null,null,null,null,null,null,null,null,null,5,null,null,null,null,null,null,null,null,null,null,null,null,null,null,null,null,null,null,null,null,null,null,null,null,5]
[1,2,3,4,5,6,7,8,9,10,11,null,13,14,15,16,17,18,19,20,21,22,23,24,6,null,null,null,29,30,31,32,33,34,35,36,37,38,39,40,16,17,18,19,20,21,22,23,24,6]
["Beépítési hely:",null,null,"Xxxx",null,null,null,null,null,null,null,null,null,0,0,0,0,0,0,null,null,null,null,null,7,null,null,null,null,null,null,null,null,null,null,null,null,null,null,null,null,null,null,null,null,null,null,null,null,7]
["Terhelési- és egyéb adatok:",null,null,null,null,null,null,null,null,null,null,null,null,0,0,0,0,0,0,null,null,null,null,null,8,null,null,null,null,null,null,null,null,null,null,null,null,null,null,null,null,"mm",null,null,null,null,null,null,null,8]
["Teherbírás:",null,null,null,null,"GQ =",1125,"kg",0,12,null,null,null,0,0,0,0,0,0,null,null,null,null,null,9,null,null,null,null,null,null,null,null,null,{"$f":"ROUND(GQ/75,0)","v":15},"személy",null,null,null,null,null,null,null,null,null,null,null,null,null,9]
["Ha a rakodógép behajt a fülkébe, annak tömege:",null,null,null,null,"GT =",0,"kg","GQr",null,null,null,null,0,0,0,0,0,0,null,null,null,null,null,10,null,null,null,null,null,null,null,null,null,null,null,null,null,null,null,null,"mm",null,null,null,null,null,null,null,10]
["Névleges sebesség:",null,null,null,null,"VKN =",1,"m/s",null,null,null,null,null,0,0,0,0,0,0,null,null,null,null,null,11,null,null,null,null,null,null,null,null,null,null,null,null,null,null,null,null,null,null,null,null,null,null,null,null,11]
["Összes megállók száma",null,null,null,null,"Nö=",6,"db",null,7,null,null,null,0,0,0,0,0,0,null,null,null,null,null,12,null,null,null,null,null,null,null,null,null,2,12,null,null,null,null,null,null,null,null,null,null,null,null,null,12]
[null,"A haladási megállók száma",null,null,null,"Nh=",7,"db",null,null,null,null,null,0,0,0,0,0,0,null,null,null,null,null,13,null,null,null,null,null,null,null,null,null,null,null,"FEL",null,null,null,null,null,null,null,null,null,null,null,null,13]
["Az óránkénti indítások száma:",null,null,null,null,"ZKH =",240,"1/h",null,null,null,null,null,0,0,0,0,0,0,null,null,null,null,null,14,null,null,null,null,null,null,null,null,null,null,null,null,null,null,null,null,null,null,null,null,null,null,null,null,14]
["Emelési magasság (max. 42,0 m): ",null,null,null,null,"HQ =",24,"m",null,null,null,null,null,null,null,null,null,null,null,null,null,null,null,null,15,null,null,null,null,null,null,null,null,null,null,null,null,"HI=",0,null,null,null,null,null,null,null,null,null,null,15]
["Süllyeszték mélysége:",null,null,null,null,"HSG =",1.4,"m",null,null,null,null,null,0,0,0,0,0,0,null,null,null,null,null,16,null,null,null,null,null,null,null,null,null,null,null,null,null,null,null,null,null,null,null,null,null,null,null,null,16]
["Fejmagasság:",null,null,null,null,"HSK =",3.72,"m",null,null,null,null,null,0,0,0,0,0,0,null,null,null,null,null,17,null,null,null,null,null,null,null,null,null,null,null,null,null,null,null,null,null,null,null,null,null,null,null,null,17]
["Aknamagasság:",null,null,null,null,"HS =",{"$f":"G15+G16+G17","v":29.119999999999997},"m",null,null,null,null,null,0,0,0,0,0,0,null,null,null,null,null,18,null,null,null,null,null,null,null,null,null,null,null,null,null,null,null,null,null,null,null,null,null,null,null,null,18]
["Fülke tömege:",null,null,null,"GK =",750,720,"kg",null,null,null,null,null,0,0,0,0,0,0,null,null,null,null,null,19,null,null,null,null,null,null,null,null,null,"GKr",810,null,null,null,null,null,null,null,null,null,null,null,null,null,19]
["Kiegyenlítési tényező:",null,null,null,null,"KG =",0.5,"-",null,null,null,null,null,0,0,0,0,0,0,null,null,null,null,null,20,null,null,null,null,null,null,null,null,null,"GGr",{"$f":"KG*GQr+GKr+(NKk*GR+NGk*GR)","v":810},null,null,null,null,null,null,null,null,null,null,null,null,null,20]
["Ellensúly tömege:",null,null,null,"GG = KG*GQ + GK  =",{"$f":"KG*GQ+GK","v":1282.5},{"$f":"IF(KZU>1,F21+(NGk*GRE),F21)","v":1282.5},"kg",null,null,null,null,null,0,0,0,0,0,0,null,null,null,null,null,21,null,null,null,null,null,null,null,null,null,null,null,null,null,null,null,null,null,null,null,null,null,null,null,null,21]
["Hajtómű tömege:",null,null,null,null,"GW =",433,"kg",null,null,null,null,null,0,0,0,0,0,0,null,null,null,null,null,22,null,null,null,null,null,null,null,null,null,null,null,null,null,null,null,null,null,null,null,null,null,null,null,null,22]
["Géptartó gerenda tömege:",null,null,null,null,"GWR=",65,"kg",null,null,null,null,null,0,0,0,0,0,0,null,null,null,null,null,23,null,null,null,null,null,null,null,null,null,null,null,"LE",null,null,null,null,null,null,null,null,null,null,null,null,23]
["Hajtótárcsa tömege:",null,null,null,null,"GD =",50,"kg",null,null,null,null,null,null,null,null,null,null,null,null,null,null,null,null,24,null,null,null,null,null,null,null,null,null,null,null,null,null,null,null,null,null,null,null,null,null,null,null,null,24]
["A függesztőkötél névleges átmérője:",null,null,null,null,"DZ = ",9,"mm",null,null,null,null,null,null,null,null,null,null,null,null,null,null,null,null,25,null,null,null,null,null,null,null,null,null,null,null,null,null,null,null,null,null,null,null,null,null,null,null,null,25]
["Kötélszerkezet:",null,{"$f":"VLOOKUP(DZ,kötél!A1:M24,2)","v":"Seale"},null,null,null,1.0942407831712657,null,null,null,null,null,null,null,null,null,null,null,null,null,null,null,null,null,26,null,null,null,null,null,null,null,null,null,4,null,null,null,"LE",null,null,null,null,null,null,null,null,null,null,26]
["A függesztőkötél darabszáma:",null,null,null,null,"ZZ = ",4,"db",null,null,null,"FZ120",null,null,null,null,null,null,null,null,null,null,null,null,27,null,null,null,null,null,null,null,null,null,null,null,"FZ120",null,"F120( Fülke)",0]
[null,null,null,null,null,"GZM1 =",{"$f":"VLOOKUP(DZ,kötél!D2:M24,10)","v":0.28999999999999998},"kg/m",null,null,null,"FZ220",null,null,null,null,null,null,null,null,null,null,null,null,28,null,null,null,null,null,null,null,null,null,null,{"$f":"LN(AN27/AN28)*0.2","v":{"$error":"#DIV/0!"}},"FZ220",null,"F220 (Ellensúly)",0]
[null,null,null,null,null,"sB  =",1570,"N/mm2",null,null,null,null,null,null,null,null,null,null,null,null,null,null,null,null,29,null,null,null,null,null,null,null,null,null,null,null,null,null,"GQr"]
["Egy kötél min. szakítóereje:",null,null,null,null,"FZM =",{"$f":"VLOOKUP(DZ,kötél!D2:M24,9)*1000","v":37300},"N ",null,null,null,null,null,null,null,null,null,null,null,null,null,null,null,null,30,null,null,null,null,null,null,null,null,null,null,null,null,null,"számított e"]
["Hajómű és keréktárcsa távolsága (Csak alsógép esetén)",null,null,null,null,"HHKf=",0,"m",null,null,null,null,null,null,null,null,null,null,null,null,null,null,null,null,null,null,null,null,null,null,null,null,null,null,null,null,null,null,"emZRN*bD"]
["Hajómű és keréktárcsa távolsága (Csak alsógép esetén)",null,null,null,null,"HHKe=",24,"m",null,null,null,null,null,null,null,null,null,null,null,null,null,null,null,null,null,null,null,null,null,null,null,null,null,null,null,null,null,null,"K1"]
["Fülke/ellensúly helyzet távolsága az emelési magasság közepétől (y=HQ/2)="]
[null,null,null,null,"Fülke fel","y_fel=",0,"m",null,null,null,null,null,null,null,null,null,null,null,null,null,null,null,null,null,null,null,null,null,null,null,null,null,null,null,null,null,null,"S=F120-F220"]
[null,null,null,null,"Fülke le","y_le=",24,"m",null,null,null,null,null,null,null,null,null,null,null,null,null,null,null,null,null,null,null,null,null,null,null,null,null,null,null,null,null,null,"N=abs(S)/μZRN",{"$f":"ABS(AN34)/VLOOKUP(HOR,$A$261:$H$265,8)","v":0},0,0,0,0,0,0,0,0,0,null,0,0,0,{"$f":"ABS(BB34)/VLOOKUP(HOR,$A$261:$H$265,8)","v":0},0,0,0,0,0]
["Függesztő kötél kiegyenlítetlen hosszának tömege:",null,null,null,null,null,null,null,null,null,null,null,null,null,null,null,null,null,null,null,null,null,null,null,null,null,null,null,null,null,null,null,null,null,null,null,null,"surlódási kúpszög=","tan(S/N)",{"$f":"DEGREES(TAN(ABS(AN34)/AN35))","v":{"$error":"#DIV/0!"}},{"$f":"DEGREES(TAN(ABS(AO34)/AO35))","v":{"$error":"#DIV/0!"}},{"$error":"#DIV/0!"},{"$error":"#DIV/0!"},{"$error":"#DIV/0!"},{"$error":"#DIV/0!"},{"$error":"#DIV/0!"},{"$error":"#DIV/0!"},{"$error":"#DIV/0!"},{"$error":"#DIV/0!"},{"$error":"#DIV/0!"},0,0,0,{"$f":"DEGREES(TAN(ABS(BB34)/BB35))","v":{"$error":"#DIV/0!"}},{"$error":"#DIV/0!"},{"$error":"#DIV/0!"},{"$error":"#DIV/0!"},{"$error":"#DIV/0!"},{"$error":"#DIV/0!"}]
["Fülke oldal:",null,null,null,null,"GZf1 = GZM1 * ZZ *HQ/2+/-y) =",{"$f":"_GZM1*ZZ*y_fel","v":0},"kg",null,null,null,null,null,null,null,null,null,null,null,null,null,null,null,null,null,null,null,null,null,null,null,null,null,null,null,null,null,null,"ln(F120/F220)/μ=β",205.56343863121648,207.5516297088829,209.5448151767894,211.54297496537316,213.54620070932833,215.55454763593221,217.56810835303338,219.58686587855306,221.61091421991364,224.04686708090003,224.04686708090003,0,0]
["Ellensúly oldal:",null,null,null,null,"GZe2=",{"$f":"_GZM1*ZZ*y_le","v":27.839999999999996},"kg",null,null,null,null,null,null,null,null,null,null,null,null,null,null,null,null,null,null,null,null,null,null,null,null,null,null,null,null,"y_fel",null,"Horony nyomás",{"$f":"$G$322","v":{"$error":"#DIV/0!"}},{"$f":"$G$321","v":{"$error":"#DIV/0!"}},"N/mm2",null,null,null,null,null,null,null,null,0,0]
["Alsógép. A fülke oldalon",null,null,null,"GZAf=GZM'*ZZ*HHKf",null,{"$f":"_GZM1*ZZ*HHKf","v":0},"kg",null,null,null,24,null,null,null,null,null,null,null,null,null,null,null,null,null,null,null,null,null,null,null,null,null,null,null,null,25.5,null,"Kötélsúly",null,null,null,null,null,null,null,null,null,null,null,0,0]
["Alsógép az ellensúly oldalon",null,null,null,"GZAe=GZM'*ZZ*HHKe",null,{"$f":"_GZM1*ZZ*HHKe","v":27.839999999999996},"kg",null,null,null,null,null,null,null,null,null,null,null,null,null,null,null,null,null,null,null,null,null,null,null,null,null,null,null,null,null,null,"Motor telj (kW)",{"$f":"(ABS(AN34)*VKN)/(1000*0.98*0.85)","v":0},0,0,0,0,0,0,0,0,0,0,0,0,{"$f":"(ABS(BA34)*VKN)/(1000*0.98*0.85)","v":0},0,0,0,0,0,0]
["Függesztő kötél teljes hossz. tömege:",null,null,null,null,"GZS= GZM1 * ZZ * (HS + HSK) * KZU =",{"$f":"_GZM1*ZZ*(HS+HSK)*KZU","v":38.094399999999993},"kg",null,null,null,null,null,null,null,null,null,null,null,null,null,null,null,null,null,null,null,null,null,null,null,null,null,null,null,null,null,null,"Nyomaték(Nm)",{"$f":"ABS(AN34)*((DD/1000)/2)","v":0},0,0,0,0,0,0,0,0,0,0,0,0,{"$f":"BA34*((DD/1000)/2)","v":0},0,0,0,0,0,0]
["A kiegyenlítőlánc javasolt folyóméter-tömege:",null,null,null,null,"GUMJ=",{"$f":"ZZ*_GZM1*KZU","v":1.1599999999999999},"kg/m",null,null,null,null,null,null,null,null,null,null,null,null,null,null,null,null,null,null,null,null,null,null,null,null,null,null,null,null,null,null,null,null,null,null,null,null,null,null,null,null,null,null,0,0]
["Kiegyenlítő lánc tömege méterenként:",null,null,null,null,"GUM=",1.1599999999999999,"kg/m",null,null,null,null,null,null,null,null,null,null,null,null,null,null,null,null,null,null,null,null,null,null,null,null,null,null,null,null,null,null,null,null,null,null,"Berakodás=",0]
["Kiegyenlítő lánc tömege:",null,null,null,null,null,null,null,null,null,null,null,null,null,null,null,null,null,null,null,null,null,null,null,null,null,null,null,null,null,null,null,null,null,null,null,null,null,null,null,null,null,null,null,null,"GQr=",{"$f":"$AJ$10","v":0}]
["Fülke oldal:",null,null,null,null,"GU = GUM * (HQ/2+/-y) *UU=",{"$f":"GUM*y_le*UU","v":0},"kg",null,null,null,null,null,null,null,null,null,null,null,null,null,null,null,null,null,null,null,null,null,null,null,null,null,null,null,null,null,null,null,null,null,null,null,null,null,"GKr=",850]
["Ellensúly oldal:",null,null,null,null,"GUe=",{"$f":"(GUM*(y_fel)*UU)","v":0},"kg"]
["Függőkábel folyóméterenkénti tömege:",null,null,null,null,"GHM =",1.2,"kg/m",null,null,null,null,null,null,null,null,null,null,null,null,null,null,null,null,null,null,null,null,null,null,null,null,null,null,{"$f":"HLOOKUP(gammaZ,B170:H171,2)","v":6.5},null,null,null,null,null,null,{"$f":"K207","v":"surlódási kúp szöge  "},null,{"$f":"L207","v":"arcustg(μZRN)"},{"$f":"IF(HOR=1,M207,\"Nem értelmezhető, nem alámetszett félkör horony\")","v":"Nem értelmezhető, nem alámetszett félkör horony"}]
["Függőkábel tömege:",null,null,null,null,"GH = GHM * (HQ/4+y/2) *HH=",{"$f":"(GHM*(HQ/4+y_fel/2))*HH","v":7.1999999999999993},"kg",null,null,null,null,null,null,null,null,null,null,null,null,null,null,null,null,null,null,null,null,null,null,null,null,null,null,null,null,null,null,null,null,null,null,null,null,{"$f":"IF(HOR=2,$M$209,\"Nem érterlmezhető nem alámetszett ékhorony\")","v":12.271520458206613}]
[null,null,null,null,null,null,null,null,null,null,null,null,null,null,null,null,null,null,null,null,null,null,null,null,null,null,null,null,null,null,null,null,null,null,null,null,null,null,null,null,null,null,null,null,{"$f":"IF(HOR=3,$M$211,\"Nem értelezhető nem alámetszés nélküli ékhorony\")","v":"Nem értelezhető nem alámetszés nélküli ékhorony"}]
["Terelőtárcsa átmérője",null,null,null,null,"DR1 =",0]
["A terlőtárcsa tömege",null,null,null,null,"GRt=",0]
["Egy terelőtárcsa tehetetlenségi nyomatéka:",null,null,null,null,"IRt =",{"$f":"0.5*GRt*POWER((DRegy/1000),2)","v":0},"kgm2 "]
["A terelőtárcsák száma a fülkei oldalon:",null,null,null,null,"NK =",0,"db"]
["A terlőtárcsák száma az ellensúly oldalán:",null,null,null,null,"NG =",0,"db"]
["A kötéltárcsák (függesztőtárcsák) névleges átmérője  fülke old:",null,null,null,null,"DR2 =",0,"mm"]
[null,null,null,null,"ells.oldal","DR3 =",0,"mm"]
["Egy kötéltárcsa tömege:",null,null,null,"fülke oldal","GR =",0,"kg"]
[null,null,null,null,"ellseúly oldal","GRE =",0,"kg",null,null,null,null,null,null,"y_le"]
["Egy kötéltárcsa tehetetlenségi nyomatéka:",null,null,null,"fülke oldal","IR =",{"$f":"0.5*GRE*(POWER(DR2___DZ/1000,2))","v":0},"kgm2 ",null,null,null,null,null,null,0]
[null,null,null,null,"ellsúly oldal","IRG =",{"$f":"0.5*GRE*(POWER(DR3__DZ/1000,2))","v":0},"kgm2 ",null,null,null,null,null,null,0,0,0,0,0,0,0,0,0]
["kötéltárcsák száma a fülke oldalon",null,null,null,null,"NKk=",0,"db",null,null,null,null,null,null,0,0,0,0,0,0,0,0,0]
["kötéltárcsák száma az ellensúly oldalon",null,null,null,null,"NGk=",0,"db",null,null,null,null,null,null,0,0,0,0,0,0,0,0,0]
["A kötéltárcsák száma azonos értelmű hajlítással:",null,null,null,null,"Nps = ",null,"db",null,null,null,null,null,null,0,0,0,0,0,0,0,0,0]
["A kötéltárcsák száma ellentétes értelmű hajlítással:",null,null,null,null,"Npr = ",0,"db",null,null,null,null,null,"emZRN*bD",0,0,0,0,0,0,0,0,0]
["A kiegyenlités feszitő tárcsa átmérő",null,null,null,null,"DRk=",0,"mm",null,null,null,null,null,null,0,0,0,0,0,0,0,0,0]
["A kiegyenlités feszitő tárcsa tömege:",null,null,null,null,"GRk=",0,"kg",null,null,null,null,null,null,0,0,0,0,0,0,0,0,0]
["A kiegyenlités feszitő tárcsa tehetetlenségi nyomatéka",null,null,null,null,"IRk=",{"$f":"0.5*GRk*(POWER(DRk/1000,2))","v":0},"kgm2 ",null,null,null,null,null,null,0,0,0,0,0,0,0,0,0]
[null,"Gépelhelyezés",null,null,null,"(Gép)",1,null,null,null,null,null,null,null,0,0,0,0,0,0,0,0,0]
[null,null,null,1,"felső",null,null,null,null,null,null,null,null,null,0,0,0,0,0,0,0,0,0]
[null,null,null,2,"alsó"]
[null,null,null,"A terelés módja (0; 1; 2)(TERM):",{"$f":"IF(TERM=0,\"nincs terelés\",(IF(TERM=1,\"ellensúly terelve (fülke hajtás)\",(IF(TERM=2,\"fülke terelve (ellensúly hajtás)\")))))","v":"nincs terelés"},null,0,{"$f":"IF(TERM=1, \"A terelés adatait ki kell tölteni\",IF(TERM=2,\"A terelés adatait ki kell tölteni\",\"\"))","v":""}]
[null,null,"nincs terelés",null,null,0]
[null,null,"ellensúly terelve (\"fülke hajtás\")",null,null,1]
[null,null,"fülke terelve (\"ellesúly hajtás\")",null,null,2]
[null,"Fülke terhelési állapota (üres=0, tele=1) (teü)",null,null,null,null,0,null,null,null,9,10]
[null,null,"HI=0,1",null,null,{"$f":"IF(G76=1,\" fülke fel\",IF(G76,\"=0\",\" fülke le\"))","v":" fülke fel"},1]
[null,"Felcsúcsszámítás (csúcs) (1= IGEN;0=NEM)",null,null,null,null,1]
[null,"Az ütköző lökete rövidített? (\"0\" = nem, \"1\" = igen) (ÜL)",null,null,null,null,0]
[null,"Az ellensúly szimmetrilus függesztésű 1=igen;2=nem) (EF)",null,null,null,null,1]
[null,null,null,null,{"$f":"IF(G80>0,\"igen, hurok-hajtás\",\"nem, nem hurokhajtás\")","v":"nem, nem hurokhajtás"},"NKkk=",0]
[null,"Függesztőelem fajtája   (Felem)",null,null,"Köteles=",0,0,null,null,null," Szint növekedés",2]
[null,null,null,null,"Hevederes=",1]
[null,null,null,null,"Függesztési tényező (KZU):",null,1]
[null,null,null,"Kiegyenlító láncfeszítő súlya (GM)=",null,null,0]
[null,null,null,"Kiegyenlítő láncok száma (UU)=",null,null,0]
[null,null,null,"Fűggőkábelek száma HH=",null,null,1,"Hurok-hajtás-e? (0, v. 1)"]
[null,null,null,null,"A hajtótárcsa horony kivitele (HOR): ",null,2]
[null,1,"   Alámetszett félkör alakú, ill. tele félkör alakú horony"]
[null,2,"   Edzés nélküli, alámetszett ékhorony "]
[null,3,"   Edzett, alámetszés nélküli ékhorony"]
[null,null,null,null,"A kötélleeresztés távolsága (TZ):",null,560,"db"]
["A hajtótárcsa és a terelőtárcsa tengelyeinek függőleges távolsága (HDA)",null,null,null,null,null,0]
[null,"(ha nincs ter.: a ht. és a kötélbek. függ. távolsága)",null,null,null,null,0]
["A hajtótárcsa átfogási szöge (számítása később):",null,null,null,null,null,null,null,null,null,null,null,null,null,14764.4541015625]
[null,null,"b = ",2.6236673967106414,null,"rad",{"$f":"180*beta_rad/PI()","v":180}]
["A fülke gyorsulása (lassulása) vészleállításkor:",null,null,null,null,"AKN=",0.5]
["A fülke szélessége (belméret):",null,null,null,null,"BK =",1200]
["A fülke mélysége (hosszúsága, belméret):",null,null,null,null,"TK =",2100]
["A fülke alapterülete:",null,null,null,null,"AKV = BK*TK ="]
[null,null,null,"AKV = BK*TK =",{"$f":"BK/1000*TK/1000","v":2.52},"m2 "]
[null,null,null,"Az 1.1 táblázatból interpolálással: AKV max =",3.1,"m2 "]
[null,null,null,"g=",9.81]
["A hajtótárcsa névleges (közép) átmérője:",null,null,null,null,"DD =",560,"mm"]
["A horony ékszöge:",null,"rad =",{"$f":"PI()*G104/180","v":0.78539816339744828},{"$f":"IF(yZ_radián<0.43,\"Nem felel meg!\",\"Megfelel\")","v":"Megfelel"},"gZ =  ",45,"o"]
["Az alámetszés szélessége:",null,null,"Almszöge=",90,"BZU =",6.6]
["Surlódási erőtény. az aknaában fülkeoldalon (TS)=",null,null,null,null,null,0]
["Surlódási erőtény. az aknaában ells.oldalon (ES)=",null,null,null,null,null,0]
[]
[]
[]
[]
[]
[]
[]
[]
[]
[]
[]
[]
[]
[]
["A kötélvezetés ábrája:"]
[]
[]
[]
[]
[]
[]
[]
[]
[]
[]
[]
[]
[]
[]
[]
[]
[]
[]
[]
[]
[]
[]
[]
[]
[]
[]
[]
[]
[]
[]
[]
[]
[]
["A hajtótárcsa-tengelyt terhelő erő:"]
[{"$f":"VLOOKUP(AN50,A1512:H1514,7)","v":"FDR = [(GK + GQ + GT + GG + GZS + GH + GU) / KZU+ GD]*g ="}]
[null,null,null,null,null,null,null,{"$f":"VLOOKUP(TERM,A1512:H1514,8)","v":31909.913064},"N"]
["A terelőtárcsa-tengelyt terhelő erő:"]
[{"$f":"VLOOKUP(AN50,A1518:H1520,7)","v":"FRR ="}]
[null,null,null,null,null,null,null,{"$f":"VLOOKUP(TERM,A1518:H1520,8)","v":0},"N"]
["Függesztő kötél:"]
["Az előírt biztonsági tényező meghatározása:"]
[{"$f":"VLOOKUP(HOR,B88:F90,2)","v":"   Edzés nélküli, alámetszett ékhorony "}]
["Az alámetszési szög:"]
[null,null,null,null,"aZ = 2*arcsin (BZU / DZ) =",{"$f":"2*ASIN(BZU/DZ)","v":1.6464239542517514},"rad     =",{"$f":"aZ_radián/PI()*180","v":94.333143867865488},"°"]
[]
["Táblázat a hajtótárcsák egyenértékű darabszámához:"]
[null,"Ékhornyok ékszögei (gZ) fokban"]
[1,35,36,38,40,42,45,50]
["Nequiv (t) ",18.5,16,12,10,8,6.5,5]
[null,"Alámetszett, félkör- vagy ékalakú hornyok (aZ) alámetszési szögei fokban:",null,null,null,null,null,null,null,null,null,null,null,null,1300]
[2,75,80,85,90,95,100,105,null,null,null,null,null,null,350]
["Nequiv (t) ",2.5,3,3.8,5,6.7,10,15.2]
["A hajtótárcsák egyenértékű darabszáma:",null,null,null,null,null,null,null,null,null,null,null,null,null,null,null,null,null,null,null,null,"HDAr1=",500]
["Ékhoronynál a táblázatból:",null,null,null,"Nequiv (t) = ",{"$f":"IF(HOR=3,HLOOKUP(gammaZ,B170:H171,2),\"Nem alámetszés nélküli horony\")","v":"Nem alámetszés nélküli horony"},null,null,null,null,null,null,null,null,null,null,null,null,null,null,null,"TDAr1=",1000]
[]
[null,null,null,null,null,null,null,null,null,null,"δ=",{"$f":"ATAN(HDAr/(TDAr))","v":1.3078015951139772},"rad",{"$f":"180*L178/PI()","v":74.931511840507795},"o ",null,null,null,{"$f":"ATAN(HDAr1/(TDAr1))","v":0.46364760900080609},"rad",{"$f":"180*S178/PI()","v":26.56505117707799},"o "]
["N equiv (t) meghatározása interpolációval alámetszett horonynál:",null,null,null,null,null,null,null,null,null,"ɜ=",{"$f":"ASIN(((DD-DRegy)/2/((TDAr)^2+HDAr^2)^0.5))","v":0.20950809746436705},"rad",{"$f":"180*L179/PI()","v":12.003929758523737},"o ",null,null,null,{"$f":"ASIN(((DD-DRegy)/2/((TDAr1)^2+HDAr1^2)^0.5))","v":0.2531343126236712},"rad",{"$f":"180*S179/PI()","v":14.503527763281516},"o "]
[" aZ 1 =",{"$f":"IF(aZ_fok<75,0,HLOOKUP(aZ_fok,B173:H174,1))","v":90},null,null,"Nequiv (t)1 = ",{"$f":"IF(aZ_fok<75,1,HLOOKUP(aZ_fok,B173:H174,2))","v":5},null,null,null,null,"β/2=",{"$f":"RADIANS(N180)","v":1.5173096925783442},"rad",{"$f":"N178+N179","v":86.935441599031535},"o ",null,null,null,{"$f":"RADIANS(U180)","v":0.7167819216244774},"rad",{"$f":"U178+U179","v":41.068578940359508},"o "]
["aZ 2 =",{"$f":"IF(aZ_fok<75,0,HLOOKUP(aZ_fok+5,B173:H174,1))","v":95},null,null,"Nequiv (t)2 = ",{"$f":"IF(aZ_fok<75,1,HLOOKUP(aZ_fok+5,B173:H174,2))","v":6.7},null,null,null,null,"β=",{"$f":"RADIANS(N181)","v":3.0346193851566885},null,{"$f":"2*N180","v":173.87088319806307},null,null,null,null,{"$f":"RADIANS(U181)","v":3.0729764118168226},null,{"$f":"U180+135","v":176.06857894035952},"o "]
[null,null,null,null,null,"Nequiv(t) = Nequiv(t)1 +  (aZ - aZ1)* (Nequiv(t)2 - Nequiv(t)1) / (aZ2 - aZ1) =",{"$f":"IF(HOR<>3,Nequiv__t_1+(aZ_fok-aZ_1)*(Nequiv__t_2-Nequiv__t_1)/IF(aZ_2-aZ_1=0,1,(aZ_2-aZ_1)),0)","v":6.4732689150742662}]
[]
["A hajtótárcsa és a terelőtárcsa átmérőviszonya:"]
[null,null,null,null,null,"Kp1 = (DD / DR1)4 = ",{"$f":"IF(DRegy<>0, POWER((DD/DRegy),4),0)","v":0}]
["A hajtótárcsa és a kötéltárcsák (függesztőtárcsák) átmérőviszonya:"]
[null,null,null,null,null,"Kp2 = (DD / DR2)4 = ",{"$f":"IF(DRkettő<>0,POWER((DD/DRkettő),4),0)","v":0}]
["A terelőtárcsák egyenértékű száma:"]
[null,null,null,null,null,"Nequiv (p) = (Nps + 4 * Npr) * Kp = ",{"$f":"IF(_Kp2<_Kp1,(Nps+4*Npr)*_Kp1,(Nps+4*Npr)*_Kp2)","v":0}]
["Az egyenértékű eredő kötéltárcsaszám:"]
[null,null,null,null,null,"Nequiv  = Nequiv(t) +  Nequiv(p) = ",{"$f":"IF(HOR<3,Nequiv_t+Nequiv__p,F176+Nequiv__p)","v":6.4732689150742662}]
["Az előírt min. biztonsági tényező:"]
[null,null,null,null,"695,85*106 * Nequiv"]
["Számított:",null,null,"log","DD  8,567 "]
[null,null,null,null,"DZ        "]
[null,null,"2,6834 -"]
[null,null,null,"log","77,09 *    DD  -2,894 "]
[null,null,null,null,"         DZ",null,null,"IZZszám"]
[null,"IZZ = 10",null,null,null,null,"=",{"$f":"10^(2.6834-LOG10(695.85*10^6*Nequiv/(DD/DZ)^8.567)/LOG10(77.09*(DD/DZ)^-2.894))","v":8.9951143981327135}]
["Előírt ","IZZmin.:",{"$f":"IF(ZZr>2,12,16)","v":16},"):",null,null,"IZZtény = ",{"$f":"IF(IZZszám<IZZmin.,IZZmin.,IZZszám)","v":16}]
["A kötél tényleges biztonsági tényezője :"]
[null,null,null,null,null,"IZ = ZZ * FZM * KZU / [(GK + GQr + GT + GZ*KZU) * g] =",{"$f":"ZZ*FZM*KZU/((GK+GQr+GT+_GZf1*KZU)*g)","v":21.12357005323366}]
[null,null,null,null,null,null,{"$f":"IF(IZ >IZZtény,\">= IZZ, megfelel\",\"< IZZ, nem felel meg.\")","v":">= IZZ, megfelel"}]
["Átmérőviszony:",null,null,null,null,"DD / DZ =",{"$f":"DD/DZ","v":62.222222222222221}]
[null,null,null,null,null,null,{"$f":"IF(DD___DZ>=40,\">= 40, megfelel\",\"< 40, nem felel meg\")","v":">= 40, megfelel"}]
[null,null,null,null,null,"DR1 / DZ =",{"$f":"IF(DRegy=0,\"nem értelmezhető\",DRegy/DZ)","v":"nem értelmezhető"}]
[null,null,null,null,null,null,{"$f":"IF(DR1___DZ>=40,\" megfelel\",\"< 40, nem felel meg\")","v":" megfelel"},null,null,null,"surlódási kúp szöge  ","arcustg(μZRN)",{"$f":"DEGREES(4*mZL*(COS(yZ_radián/2)-SIN(aZ_radián/2))/(PI()-aZ_radián-yZ_radián-SIN(aZ_radián)+SIN(yZ_radián)))","v":10.404159005400791},"°"]
[null,null,null,null,null,"DR2 / DZ =",{"$f":"IF(DRkettő=0,\"nem értelmezhető\",DRkettő/DZ)","v":"nem értelmezhető"}]
[null,null,null,null,null,null,{"$f":"IF(DR2___DZ>=40,\"megfelel\",\"< 40, nem felel meg\")","v":"< 40, nem felel meg"},null,null,null,null,null,{"$f":"DEGREES(4*mZL*(1-SIN(aZ_radián/2))/(PI()-aZ_radián-SIN(aZ_radián)))","v":12.271520458206613},"°"]
["Az átfogási szög meghatározása:"]
[null,null,null,null,null,null,null,null,null,null,null,null,{"$f":"DEGREES(mZN/(SIN(yZ_radián/2)))","v":74.860543555515989},"°"]
[]
[null,null,null,null,null,null,null,null,null,null,"FEL"]
[]
[]
[]
[]
[null,null,null,null,null,null,null,null,null,null,null,null,null,null,null,null,null,null,null,null,null,null,null,null,null,null,null,null,null,null,null,null,null,null,null,null,null,null,null,null,null,null,null,null,null,null,null,null,null,null,null,null,null,null,null,null,null,null,null,null,null,null,null,null,null,null,null,null,null,null,null,null,null,null,null,null,null,null,null,null,null,null,null,null,null,null,null,null,null,null,null,null,null,null,null,null,null,null,null,null,null,null,null,null,null,null,null,null,null,null,null,null,null,null,null,null,null,null,null,null,null,null,null,null,null,null,null,null,null,null,null,null,null,null,null,null,null,null,null,null,null,null,null,null,null,null,null,null,null,null,null,null,null,null,null,null,null,null,null,null,null,null,null,null,null,null,null,null,null,null,null,null,null,null,null,null,null,null,null,null,null,null,null,null,null,null,null,null,null,null,null,null,null,null,null,null,null,null,null,null,null,null,null,null,null,null,null,null,null,null,null,null,1.5809651628605113,0.69725902371802517,0.86131996973385838,0.94335044274177504,1.0253809157496916,1.1074113887576083,0.69725902371802517,0.86131996973385838,0.94335044274177504,1.0253809157496916,1.1074113887576083,1.1894418617655249,1.2714723347734416,1.3535028077813582,1.4355332807892747,1.5175637537971913,0.77928949672594183,0.86131996973385838,0.94335044274177504,1.0253809157496916,1.1074113887576083,1.1894418617655249,1.2714723347734416,1.3535028077813582,1.4355332807892747,1.5175637537971913,1.1074113906109813,1.2239810096217989,1.2735230977013963,1.3183468916781751,1.3590957952934284,1.3963013159856161,1.4304063766201216,1.4617830324038668,1.4907460992811699,1.5175637537971913,1.1074113906109813,1.2239810096217989,1.2735230977013963,1.3183468916781751]
[]
[]
[]
[]
[]
[]
[]
[]
[null,null,null,null,null,"TDA = TZ - (DD + DR1) / 2 =",{"$f":"IF(HDA=0,DD-(DD-DRegy)/2,TZ-(DD+DRegy)/2)","v":280},"mm"]
[null,null,null,null,"d = arc tg (HDA / TDA) =",{"$f":"IF(TDA=0,PI()/2,ATAN(HDA/TDA))","v":0},"rad = ",{"$f":"180*delta_radián/PI()","v":0}]
[null,null,null,null,"e = arc sin [(DD-DR1) / (2 * (TDA2 + HDA2)0,5)] =",{"$f":"ASIN(((DD-DRegy)/(2*(TDA^2+HDA^2)^0.5)))","v":1.5707963267948966},"rad = ",{"$f":"180*epszilon_radián/PI()","v":90}]
["Átfogási szög a hajtótárcsán:",null,null,{"$f":"IF(G80>0,\"(hurok-hajtás)\",\" \")","v":" "},null,null,null,null,null,null,{"$f":"(GQ+GK)*(g+(AKN/KZU))","v":19021.95}]
[null,null,null,null,{"$f":"IF(G80>0,\"b = 1,5 * p + d + 3 * e =\",\"b = p / 2 + d + e =\")","v":"b = p / 2 + d + e ="},{"$f":"IF(hurok?>0,1.5*PI()+delta_radián+3*epszilon_radián,PI()/2+delta_radián+epszilon_radián)","v":3.1415926535897931},"rad = ",{"$f":"180*beta_rad/PI()","v":180}]
[]
[]
[]
[]
[null,null,null,null,null,null,null,null,null,null,null,null,null,null,null,null,null,null,null,1.5093069212396069]
["A hajtótárcsa és a kötél kapcsolatának ellenőrzése",null,null,null,null,null,null,null,null,null,null,null,null,null,null,null,null,null,null,1.5093069212396069]
["Horony=",{"$f":"HOR","v":2},null,null,null,null,null,null,null,null,null,null,null,null,null,null,null,null,null,1.5093069212396069]
["A fülkébe való berakodás:",null,null,"(A 125 % terhelésű, illetve az esetlegesen behajtó rakodógéppel terhelt fülke statikusan nem csúszhat meg)",null,null,null,null,null,null,null,null,null,null,null,null,null,null,null,1.5010500886820226]
[null,null,null,null,null,null,null,null,null,null,null,null,null,null,null,null,null,null,null,1.4969216724032304]
["A statikus súrlódási tényező:",null,null,null,"Kötels","mZL =",0.1,null,null,null,null,null,null,null,null,null,null,null,null,1.4969216724032304]
["A látszólagos súrlódási tényező:",null,null,null,"Hevederes","mzl_h=",0.25,null,null,null,null,null,null,null,null,null,null,null,null,1.4969216724032304]
["Félkör alakú alámetszett horony esetén:",null,null,null,null,null,null,null,null,null,null,null,null,null,null,null,null,null,null,1.4969216724032304]
[1,null,null,null,null,null,"mZRL = 4*mZL*(cosgZ/2 - sinaZ/2) / (p-aZ-gZ-sinaZ+singZ) =",{"$f":"IF(HOR=0,4*mZL*(COS(yZ_radián/2)-SIN(aZ_radián/2))/(PI()-aZ_radián-yZ_radián-SIN(aZ_radián)+SIN(yZ_radián)),\"Nem félkör horony\")","v":"Nem félkör horony"},null,null,null,null,null,null,null,null,null,null,null,1.4969216724032304]
["Edzés nélküli, alámetszett ékhorony esetén:",null,null,null,null,null,null,null,null,null,null,null,null,null,null,null,null,null,null,1.4969216724032304]
[2,null,null,null,null,null,"mZRL = mZL*(4*(1 - sin aZ/2) / (p - aZ - sinaZ )) =",{"$f":"J248/J249","v":0.21417843622154858},null,null,null,null,null,null,null,null,null,null,null,1.4969216724032304]
["Edzett ékhorony esetén:",null,null,null,null,null,null,null,null,null,null,null,null,null,null,null,null,null,null,1.4969216724032304]
[3,null,null,null,null,null,"mZRL = mZL /  (sin gZ/2) =",{"$f":"IF(HOR=3,IF(Felem=1,mzl_h/SIN(yZ_radián/2),mZL/SIN(yZ_radián/2)),\"Nem edzett ékhorony!\")","v":"Nem edzett ékhorony!"},null,{"$f":"mZL*(4*(1-SIN(aZ_radián/2)))","v":0.10666666666666669},null,null,null,null,null,null,null,null,null,1.4969216724032304]
["Az áthúzási viszonyszám:",null,null,null,null,null,null,null,"˚",{"$f":"PI()-(aZ_radián)-SIN(aZ_radián)","v":0.49802710556878604},null,null,null,null,null,null,null,null,null,1.4969216724032304]
[null,null,null,null,null,null,"e mZRL * bD =",{"$f":"EXP(VLOOKUP(HOR,A244:H248,8)*beta_rad)","v":1.9598371867178024},null,null,null,null,null,null,null,null,null,null,null,1.4969216724032304]
["A statikus erők viszonya:",null,null,null,null,null,null,null,null,null,null,null,null,null,null,null,null,null,null,1.4969216724032304]
[null,null,null,null,null,null,{"$f":"+IF(G10>0.25*G9,\"IZD1 = FZ11 / FZ21 = (GQ + GT + GK + GZ*KZU) / GG =\",\"IZD1 = FZ11 / FZ21 = (1,25*GQ + GK + GZ*KZU) / GG = \")","v":"IZD1 = FZ11 / FZ21 = (1,25*GQ + GK + GZ*KZU) / GG = "},{"$f":"IF(GT<0.25*GQ,(1.25*GQ+GK+_GZf1*KZU)/GG,(GQ+GK+GT+_GZf1*KZU)/GG)","v":1.6578947368421053},null,null,null,null,null,null,null,null,null,null,null,1.4969216724032304]
["F121",null,null,null,28730.859375,null,null,null,null,null,null,null,null,null,null,0,0,0,0,0,0,0,0,0,0,0,0,0,0,0,0,0,0,0,0,0,0,0,0,0,0,0,0,0,0,0,0,0,0,0,0,0,0,0,0,0,0,0,0,0,0,0,0,0,0,0,0,0,0,0,0,0,0,0,0,0,0,0,0,0,0,0,0,0,0,0,0,0,0,0,0,0,0,0,0,0,0,0,0,0,0,0,0,0,0,0,0,0,0,0,0,0,0,0,0,0,0,0,0,0,0,0,0,0,0,0,0,0,0,0,0,0,0,0,0,0,0,0,0,0,0,0,0,0,0,0,0,0,0,0,0,0,0,0,0,0,0,0,0,0,0,0,0,0,0,0,0,0,0,0,0,0,0,0,0,0,0,0,0,0,0,0,0,0,0,0,0,0,0,0,0,0,0,0,0,0,0,0,0,0,0,0,0,0,0,0,0,0,0,0,0,0,0,0,0,0,0,0,0,0,0,0,0,0,0,0,0,0,0,0,0,0,0,0,0,0,0,0,0,0,0,0,0,0,0,0,0,0,0,0,0,0,0,0,0,0]
["F221",null,null,null,21954.728515625,null,null,null,null,null,null,null,null,null,null,0,0,0,0,0,0,0,0,0,0,0,0,0,0,0,0,0,0,0,0,0,0,0,0,0,0,0,0,0,0,0,0,0,0,0,0,0,0,0,0,0,0,0,0,0,0,0,0,0,0,0,0,0,0,0,0,0,0,0,0,0,0,0,0,0,0,0,0,0,0,0,0,0,0,0,0,0,0,0,0,0,0,0,0,0,0,0,0,0,0,0,0,0,0,0,0,0,0,0,0,0,0,0,0,0,0,0,0,0,0,0,0,0,0,0,0,0,0,0,0,0,0,0,0,0,0,0,0,0,0,0,0,0,0,0,0,0,0,0,0,0,0,0,0,0,0,0,0,0,0,0,0,0,0,0,0,0,0,0,0,0,0,0,0,0,0,0,0,0,0,0,0,0,0,0,0,0,0,0,0,0,0,0,0,0,0,0,0,0,0,0,0,0,0,0,0,0,0,0,0,0,0,0,0,0,0,0,0,0,0,0,0,0,0,0,0,0,0,0,0,0,0,0,0,0,0,0,0,0,0,0,0,0,0,0,0,0,0,0,0,0]
["Vészleállítás:",null,"(A névleges terhelésű, ill. a terheletlen fülke dinamikus viselkedése)",null,null,null,null,null,null,null,null,null,null,null,null,0,0,0,0,0,0,0,0,0,0,0,0,0,0,0,0,0,0,0,0,0,0,0,0,0,0,0,0,0,0,0,0,0,0,0,0,0,0,0,0,0,0,0,0,0,0,0,0,0,0,0,0,0,0,0,0,0,0,0,0,0,0,0,0,0,0,0,0,0,0,0,0,0,0,0,0,0,0,0,0,0,0,0,0,0,0,0,0,0,0,0,0,0,0,0,0,0,0,0,0,0,0,0,0,0,0,0,0,0,0,0,0,0,0,0,0,0,0,0,0,0,0,0,0,0,0,0,0,0,0,0,0,0,0,0,0,0,0,0,0,0,0,0,0,0,0,0,0,0,0,0,0,0,0,0,0,0,0,0,0,0,0,0,0,0,0,0,0,0,0,0,0,0,0,0,0,0,0,0,0,0,0,0,0,0,0,0,0,0,0,0,0,0,0,0,0,0,0,0,0,0,0,0,0,0,0,0,0,0,0,0,0,0,0,0,0,0,0,0,0,0,0,0,0,0,0,0,0,0,0,0,0,0,0,0,0,0,0,0,0,0]
["A kötél sebessége:",null,null,null,null,"VZ = VKN * KZU =",{"$f":"VKN*KZU","v":1},"m/s",null,null,null,null,null,null,null,0,0,0,0,0,0,0,0,0,0,0,0,0,0,0,0,0,0,0,0,0,0,0,0,0,0,0,0,0,0,0,0,0,0,0,0,0,0,0,0,0,0,0,0,0,0,0,0,0,0,0,0,0,0,0,0,0,0,0,0,0,0,0,0,0,0,0,0,0,0,0,0,0,0,0,0,0,0,0,0,0,0,0,0,0,0,0,0,0,0,0,0,0,0,0,0,0,0,0,0,0,0,0,0,0,0,0,0,0,0,0,0,0,0,0,0,0,0,0,0,0,0,0,0,0,0,0,0,0,0,0,0,0,0,0,0,0,0,0,0,0,0,0,0,0,0,0,0,0,0,0,0,0,0,0,0,0,0,0,0,0,0,0,0,0,0,0,0,0,0,0,0,0,0,0,0,0,0,0,0,0,0,0,0,0,0,0,0,0,0,0,0,0,0,0,0,0,0,0,0,0,0,0,0,0,0,0,0,0,0,0,0,0,0,0,0,0,0,0,0,0,0,0,0,0,0,0,0,0,0,0,0,0,0,0,0,0,0,0,0,0]
["A fülke lassulása:",null,null,null,null,"AKN =",0.5,"m/s2 ",null,null,null,null,null,null,null,0,0,0,0,0,0,0,0,0,0,0,0,0,0,0,0,0,0,0,0,0,0,0,0,0,0,0,0,0,0,0,0,0,0,0,0,0,0,0,0,0,0,0,0,0,0,0,0,0,0,0,0,0,0,0,0,0,0,0,0,0,0,0,0,0,0,0,0,0,0,0,0,0,0,0,0,0,0,0,0,0,0,0,0,0,0,0,0,0,0,0,0,0,0,0,0,0,0,0,0,0,0,0,0,0,0,0,0,0,0,0,0,0,0,0,0,0,0,0,0,0,0,0,0,0,0,0,0,0,0,0,0,0,0,0,0,0,0,0,0,0,0,0,0,0,0,0,0,0,0,0,0,0,0,0,0,0,0,0,0,0,0,0,0,0,0,0,0,0,0,0,0,0,0,0,0,0,0,0,0,0,0,0,0,0,0,0,0,0,0,0,0,0,0,0,0,0,0,0,0,0,0,0,0,0,0,0,0,0,0,0,0,0,0,0,0,0,0,0,0,0,0,0,0,0,0,0,0,0,0,0,0,0,0,0,0,0,0,0,0,0]
["A mozgási súrlódási tényező:",null,null,null,null,"mZN = 0,1 / (1 + VZ/10) =",{"$f":"0.1/(1+H259/10)","v":0.1},null,null,null,null,null,null,null,null,0,0,0,0,0,0,0,0,0,0,0,0,0,0,0,0,0,0,0,0,0,0,0,0,0,0,0,0,0,0,0,0,0,0,0,0,0,0,0,0,0,0,0,0,0,0,0,0,0,0,0,0,0,0,0,0,0,0,0,0,0,0,0,0,0,0,0,0,0,0,0,0,0,0,0,0,0,0,0,0,0,0,0,0,0,0,0,0,0,0,0,0,0,0,0,0,0,0,0,0,0,0,0,0,0,0,0,0,0,0,0,0,0,0,0,0,0,0,0,0,0,0,0,0,0,0,0,0,0,0,0,0,0,0,0,0,0,0,0,0,0,0,0,0,0,0,0,0,0,0,0,0,0,0,0,0,0,0,0,0,0,0,0,0,0,0,0,0,0,0,0,0,0,0,0,0,0,0,0,0,0,0,0,0,0,0,0,0,0,0,0,0,0,0,0,0,0,0,0,0,0,0,0,0,0,0,0,0,0,0,0,0,0,0,0,0,0,0,0,0,0,0,0,0,0,0,0,0,0,0,0,0,0,0,0,0,0,0,0,0,0]
["A látszólagos súrlódási tényező:",null,null,null,null,null,null,null,null,null,null,null,null,null,null,0,0,0,0,0,0,0,0,0,0,0,0,0,0,0,0,0,0,0,0,0,0,0,0,0,0,0,0,0,0,0,0,0,0,0,0,0,0,0,0,0,0,0,0,0,0,0,0,0,0,0,0,0,0,0,0,0,0,0,0,0,0,0,0,0,0,0,0,0,0,0,0,0,0,0,0,0,0,0,0,0,0,0,0,0,0,0,0,0,0,0,0,0,0,0,0,0,0,0,0,0,0,0,0,0,0,0,0,0,0,0,0,0,0,0,0,0,0,0,0,0,0,0,0,0,0,0,0,0,0,0,0,0,0,0,0,0,0,0,0,0,0,0,0,0,0,0,0,0,0,0,0,0,0,0,0,0,0,0,0,0,0,0,0,0,0,0,0,0,0,0,0,0,0,0,0,0,0,0,0,0,0,0,0,0,0,0,0,0,0,0,0,0,0,0,0,0,0,0,0,0,0,0,0,0,0,0,0,0,0,0,0,0,0,0,0,0,0,0,0,0,0,0,0,0,0,0,0,0,0,0,0,0,0,0,0,0,0,0,0,0]
["Félkör alakú alámetszett horony esetén:",null,null,null,null,null,null,null,null,null,null,null,null,null,null,null,null,null,null,1.4969216724032304]
[1,null,null,null,null,null,"mZRN = 4*mZN*(cosgZ/2-sinaZ/2) / (p-aZ-gZ-sinaZ+singZ) =",{"$f":"IF(HOR=1,4*mZN*(COS(yZ_radián/2)-SIN(aZ_radián/2))/(PI()-aZ_radián-yZ_radián-SIN(aZ_radián)+SIN(yZ_radián)),\"Nem félkör-horony!\")","v":"Nem félkör-horony!"},null,null,null,null,null,null,null,null,null,null,null,1.4969216724032304]
["Edzés nélküli, alámetszett ékhorony esetén:",null,null,null,null,null,null,null,null,null,null,null,null,null,null,null,null,null,null,1.4969216724032304]
[2,null,null,null,null,null,"mZRN = 4*mZL*(1 - sin aZ/2) / (p - aZ - sinaZ ) =",{"$f":"IF(HOR=2,4*mZL*(1-SIN(aZ_radián/2))/(PI()-aZ_radián-SIN(aZ_radián)),\"Nem alám. ékhorony!\")","v":0.21417843622154858},null,null,null,null,null,null,null,null,null,null,null,1.4969216724032304]
["Edzett ékhorony esetén:",null,null,null,null,null,null,null,null,null,null,null,null,null,null,null,null,null,null,1.4969216724032304]
[3,null,null,null,null,null,"mZRN = mZN /  (sin g/2) =",{"$f":"IF(HOR=3,mZN/(SIN(yZ_radián/2)),\"Nem edzett ékhorony!\")","v":"Nem edzett ékhorony!"},null,null,null,null,null,null,null,null,null,null,null,1.4969216724032304]
[null,null,null,null,null,null,null,null,null,null,null,null,null,null,null,null,null,null,null,1.4969216724032304]
["Az áthúzási viszonyszám:",null,null,null,null,null,"e mZRN * bD =",{"$f":"EXP(VLOOKUP(HOR,A261:H265,8)*beta_rad)","v":1.9598371867178024},null,null,null,null,null,null,null,null,null,null,null,1.4969216724032304]
["A dinamikus erők viszonya terhelt fülke mellett:",null,null,null,null,null,null,null,null,null,null,null,null,null,null,null,null,null,null,1.4969216724032304]
["(A fülke az alsó véghelyzetben lefelé haladva lassul)",null,null,null,null,null,null,null,null,null,null,null,null,null,null,null,null,null,null,1.4969216724032304]
[null,null,null,null,null,null,"FZ120= (GQ+GK)*(g+AKN)/KZU+GZ*(g+KZU*AKN)+4*IR*NK*AKN/DR2 =",{"$f":"IF(DRegy=0,(GQ+GK)*(9.81+(AKN/KZU))+_GZe2*(9.81+KZU*AKN),(GQ+GK)*(9.81+AKN)/KZU+_GZe2*(9.81+KZU*AKN)+4*IR*NK*AKN/(DRegy/1000)^2)","v":19308.9804},"N",null,null,null,null,null,null,null,null,null,null,1.4969216724032304]
[null,null,null,null,null,null," FZ220=(GG+GU)*(g - AKN)/KZU+GZ*(g-KZU*AKN) - 4*IR*NG*AKN/DR2 =",{"$f":"IF(DRegy=0,(GG+GUe)*(9.81-AKN)/KZU+_GZf1*(9.81+KZU*AKN),(GG+GUe)*(9.81-AKN)/KZU+_GZf1*(9.81+KZU*AKN)-4*IR*NK*AKN/DRegy^2)","v":11940.075000000001},"N",null,null,null,null,null,null,null,null,null,null,1.4969216724032304]
[null,null,null,null,null,null,"IZD2 = FZ120 / FZ220 = ",{"$f":"FZ120___GQ_GK___g_AKN__KZU_GZ__g_KZU_AKN__4_IR_NK_AKN_DR2/FZ220__GG_GU___g___AKN__KZU_GZ__g_KZU_AKN____4_IR_NG_AKN_DR2","v":1.6171573796647005},"i=",null,null,null,null,null,null,null,null,null,null,1.4969216724032304]
[null,null,null,null,{"$f":"IF(H267<H272,\"IZD2 >\",\"IZD2 <=\")","v":"IZD2 <="},"e mZRN * bD",null,{"$f":"IF(e_mZRN___bD<_IZD2,\"nem felel meg\",\"megfelel\")","v":"megfelel"},"y=",null,null,null,null,null,null,null,null,null,null,1.4969216724032304]
[1,2,3,4,5,6,7,8,9,null,null,null,null,null,null,null,null,null,null,1.4969216724032304]
["A dinamikus erők viszonya üres fülke mellett:",null,null,null,null,null,null,null,null,null,null,null,null,null,null,null,null,null,null,1.4969216724032304]
["(A fülke a felső véghelyzetben felfelé haladva lassul)",null,null,null,null,null,null,null,null,null,null,null,null,null,null,null,null,null,null,1.4969216724032304]
[null,null,null,null,null,null,"FZ121 = (GK+GH+GU)*(g - AKN)/KZU - 4*IR*NK*AKN/DR2 =",{"$f":"IF(DRegy=0,(GK+GH+GU)*(9.81-(AKN/KZU)),(GK+GH+GU)*(9.81-AKN)/KZU-4*IR*NK*AKN/(DRegy/1000)^2)","v":6770.2320000000009},"N",null,null,null,null,null,null,null,null,null,null,1.4969216724032304]
[null,null,null,null,null,null,"FZ221 = GG*(g+AKN)/KZU+GZ*(g+KZU*AKN)+4*IR*NG*AKN/DR2 =",{"$f":"IF(DRegy=0,GG*(9.81+(AKN/KZU))+_GZe2*(9.81+KZU*AKN),GG*(9.81+AKN)/KZU+_GZe2*(9.81+KZU*AKN)+4*IR*NK*AKN/(DRegy/1000)^2)","v":13509.6054},"N",null,null,null,null,null,null,null,null,null,null,1.4969216724032304]
[null,null,null,null,null,null,"IZD3 = FZ221 / FZ121 = ",{"$f":"FZ221___GG__g_AKN__KZU_GZ__g_KZU_AKN__4_IR_NG_AKN_DR2/FZ121____GK_GH_GU___g___AKN__KZU___4_IR_NK_AKN_DR2","v":1.9954420173488883},null,null,null,null,null,null,null,null,null,null,null,1.4969216724032304]
[null,null,null,null,{"$f":"IF(H267<H279,\"IZD3 >\",\"IZD3 <=\")","v":"IZD3 >"},"e mZRN * bD",null,{"$f":"IF(e_mZRN___bD<_IZD3,\"nem felel meg\",\"megfelel\")","v":"nem felel meg"},null,null,null,null,null,null,null,null,null,null,null,1.4969216724032304]
["Elakadt fülke:",null,null,null,null,null,null,null,null,null,null,null,null,null,null,null,null,null,null,1.4969216724032304]
[null,"(A névleges terhelésű, ill. a terheletlen fülke statikus viselkedése, miközben a fülke ill. az ellensúly az ütközőn ül. A hajtásnak meg kell csúsznia.)",null,null,null,null,null,null,null,null,null,null,null,null,null,null,null,null,null,1.4969216724032304]
[null,null,null,null,null,null,null,null,null,null,null,null,null,null,null,null,null,null,null,1.4969216724032304]
[]
["A nyugvó surlódási tényező:",null,null,null,"Köteles","mZP = ",0.2]
[null,null,null,null,"Hevederes","mZP_h=",null,0.6]
["A látszólagos súrlódási tényező:",null,null,null,null,"surlodási kúp=",{"$f":"DEGREES(mZP)","v":11.459155902616466},{"$f":"DEGREES(mZP_h)","v":34.377467707849391},null,null,null,null,null,null,null,null,null,null,null,1.4969216724032304]
["Félkör alakú alámetszett horony esetén:",null,null,null,null,null,null,null,null,null,null,null,null,null,null,null,null,null,null,1.4969216724032304]
[null,null,null,null,null,null,"mZRP = 4*mZP*(cosgZ/2 - sinaZ/2)/(p - aZ - gZ - sinaZ+singZ) =",{"$f":"IF(HOR=1,4*mZP*(COS(yZ_radián/2)-SIN(aZ_radián/2))/(PI()-aZ_radián-yZ_radián-SIN(aZ_radián)+SIN(yZ_radián)),\"Nem félkör-horony!\")","v":"Nem félkör-horony!"},null,null,null,null,null,null,null,null,null,null,null,1.4969216724032304]
["Edzett és edzés nélküli ékhorony esetén:"]
[null,null,null,null,null,null,"mZRP = mZP /  (sin gZ/2) =",{"$f":"IF(HOR>1,IF(Felem=1,mZP_h/(SIN(yZ_radián/2)),mZP/(SIN(yZ_radián/2))),\"Nem ékhorony!\")","v":0.52262518595055063}]
[null,null,null,null,{"$f":"IF(H292>G287,\"Meg kell csúszni\",\"Nem csúszik meg\")","v":"Meg kell csúszni"},null,"surlódási kúp",{"$f":"DEGREES(mZRP_elakadtfül_edzet_és_edz_nélk_ékhor)","v":29.9442174222064},"˚"]
["Az áthúzási viszonyszám:",null,null,null,null,null,"e mZRP * bD =",{"$f":"IF(HOR=1,EXP(mZRP_elakadtfül_félkör_alámetsz.*beta_rad),EXP(mZRP_elakadtfül_edzet_és_edz_nélk_ékhor*beta_rad))","v":5.1648468196913662}]
["A statikus erők viszonya terhelt fülke mellett:"]
["(Az ellensúly ütközőre ült)"]
[null,null,null,null,null,null,"IZD4 = FZ13 / FZ23 = (GQ + GK + GH + GU) / GZ*KZU =",{"$f":"IF(_GZe2<>0,(GQ+GK+GH+GU)/(_GZe2*KZU),\"Nem értelmezhető, az ellensúly az ütközön ül\")","v":66.53017241379311}]
[null,null,null,{"$f":"IF(H293<H296,\"IZD4 >\",\"IZD4 <=\")","v":"IZD4 >"},"e mZRP * bD",null,{"$f":"IF(e_mZRP__bD<_IZD4,\"megcsúszik, megfelel\",\"nem felel meg\")","v":"megcsúszik, megfelel"}]
["A statikus erők viszonya üres fülke mellett:"]
["(A fülke ütközőre ült)"]
[null,null,null,null,null,null,"IZD5 = FZ24 / FZ14 =  (GG + GU) / GZ*KZU =",{"$f":"IF(_GZf1<>0,(GG+GU)/(_GZf1*KZU),\"Nem értelmezhető\")","v":"Nem értelmezhető"}]
[]
[null,null,null,{"$f":"IF(H293<H300,\"IZD5 >\",\"IZD5 <=\")","v":"IZD5 >"},"e mZRP * bD",null,{"$f":"IF(_GZf1<>0,IF(e_mZRP__bD<_IZD5,\"megcsúszik, megfelel\",\"nem felel meg\"),\"Nem értelmezhető!\")","v":"Nem értelmezhető!"}]
["Ellenőrzés horonynyomásra:"]
[]
["Kötélsebesség:",null,null,null,null,"VZ = VKN * KZU =",{"$f":"VKN*KZU","v":1},"m/s"]
["Az óránkénti indítások számától függő tényező:"]
[]
[null,null,null,null,null,"K = (52 - ZKH2 / 3600 - ZKH / 60) / 50 =",{"$f":"(52-ZKH^2/3600-ZKH/60)/50","v":0.64}]
["A számított megengedett horonynyomás:"]
[null,null,null,null,null,"PZZ = K *(12,5+4*VZ)/(1+VZ) =",{"$f":"K*(12.5+4*VZ)/(1+VZ)","v":{"$error":"#REF!"}},"N/mm2","   "]
["A megengedett horonynyomás (max. 8,75 N/mm2 ):"]
[null,null,null,null,null,"PZZ =",{"$f":"IF(PZZ>8.75,8.75,PZZ)","v":{"$error":"#REF!"}},"N/mm2"]
["Egy kötélre eső legnagyobb terhelés:"]
[null,null,null,null,null,"FZM1 = (GQr + GK + GZS) * g / ZZr * KZU =",{"$f":"(GQ+GK+GZS)*9.81/(ZZr*KZU)","v":{"$error":"#DIV/0!"}},"N",null,null,{"$f":"C327","v":1.8718711137771606},1.8959490060806274,1.9204696416854858,1.9454450607299805,1.9708883762359619,1.9968128204345703]
["A horonyalak-tényező:",null,null,null,null,null,null,null,null,null,1.5119770765304565,1.532776951789856,1.5539592504501343,1.5755347013473511,1.5975141525268555,1.6199090480804443]
["Félkör alakú, alámetszett horony esetén:"]
[null,null,null,null,null,"  KDR = 8 * cos (aZ/2) / (p - aZ - sin aZ) =",{"$f":"IF(HOR=1,8*COS(aZ_radián/2)/(PI()-aZ_radián-SIN(aZ_radián)), \"Nem félkör-horony!\")","v":"Nem félkör-horony!"}]
["Edzett és edzés nélküli ékhorony esetén:"]
[null,null,null,null,null,"KDR1 = 4,5 / sin (gZ / 2) = ",{"$f":"IF(HOR>1,4.5/SIN(yZ_radián/2),\"Nem ékhorony!\")","v":11.759066683887388}]
["A fellépő horonynyomás:"]
[null,null,null,null,null,"PZ = KDR * FZM1 / (DZ * DD) =",{"$f":"IF(HOR>1,_KDR1*_FZM1/(DZ*DD),KDR*_FZM1/(DZ*DD))","v":{"$error":"#DIV/0!"}},"N/mm2"]
[null,null,null,null,{"$f":"IF(G321<G312,\"PZ<\",\"PZ > \")","v":{"$error":"#DIV/0!"}},"PZZ",{"$f":"IF(PZ>PZZ,\"nem felel meg\",\" megfelel\")","v":{"$error":"#DIV/0!"}}]
[]
["F121=","T1",7090.21044921875,7026.21484375,6962.21923828125,6898.2236328125,6834.2275390625,6770.23193359375,0,0,0,0,0,0,0,0,0,0,0,0,0,0,0,0,0,0,0,0,0,0]
["F221=","T2",13271.9599609375,13321.3447265625,13370.73046875,13420.115234375,13469.5,13518.8857421875,0,0,0,0,0,0,0,0,0,0,0,0,0,0,0,0,0,0,0,0,0,0]
["S=","T1-T2",-6181.74951171875,-6295.1298828125,-6408.51123046875,-6521.8916015625,-6635.2724609375,-6748.65380859375,0,0,0,0,0,0,0,0,0,0,0,0,0,0,0,0,0,0,0,0,0,0]
["emü",null,1.8718711137771606,1.8959490060806274,1.9204696416854858,1.9454450607299805,1.9708883762359619,1.9968128204345703,0,0,0,0,0,0,0,0,0,0,0,0,0,0,0,0,0,0,0,0,0,0]
["Átfogási szög",null,-167.71496859459072,-171.13405991113163,-174.57168754613355,-178.02824934667566,-181.50423219516364,-185.00007712747217,0,0,0,0,0,0,0,0,0,0,0,0,0,0,0,0,0,0,0,0,19747.979573107881,19747.979573107881,19747.979573107881,19747.979573107881,19747.979573107881,19747.979573107881,19747.979573107881,19747.979573107881,19747.979573107881,19747.979573107881,19747.979573107881,19747.979573107881,19747.979573107881,19747.979573107881,19747.979573107881,19747.979573107881,19747.979573107881,19747.979573107881,19747.979573107881,19747.979573107881,19747.979573107881,19747.979573107881,19747.979573107881,19747.979573107881,19747.979573107881,19747.979573107881,19747.979573107881,19747.979573107881,19747.979573107881,19747.979573107881,19747.979573107881,19747.979573107881,19747.979573107881,19747.979573107881,19747.979573107881,19747.979573107881]
[null,null,0,0,0,0,0,0,0,0,0,0,0,0,0,0,0,0,0,0,0,0,0,0,0,0,0,0,9403.8182899358198,9403.8182899358198,9403.8182899358198,9403.8182899358198,9403.8182899358198,9403.8182899358198,9403.8182899358198,9403.8182899358198,9403.8182899358198,9403.8182899358198,9403.8182899358198,9403.8182899358198,9403.8182899358198,9403.8182899358198,9403.8182899358198,9403.8182899358198,9403.8182899358198,9403.8182899358198,9403.8182899358198,9403.8182899358198,9403.8182899358198,9403.8182899358198,9403.8182899358198,9403.8182899358198,9403.8182899358198,9403.8182899358198,9403.8182899358198,9403.8182899358198,9403.8182899358198,9403.8182899358198,9403.8182899358198,9403.8182899358198,9403.8182899358198,9403.8182899358198,9403.8182899358198,9403.8182899358198]
["Nyomaték","(Nm)",0,0,0,0,0,0,0,0,0,0,0,0,0,0,0,0,0,0,0,0,0,0,0,0,0,0,0,0]
["Motor teljesítmény (kW)",null,0,0,0,0,0,0,0,0,{"$f":"(ABS(K326)*VKN)/(1000*0.98*0.85)","v":0},0,0,0,0,0,0,0,0,0,0,0,0,0,0,0,0,0,0,0]
[null,null,null,null,null,null,null,null,null,null,null,null,null,null,null,0,0,0,0,0,0,0,0,0,0,0,0,0,-5.7323192956501465,-5.7323192956501465,-5.7323192956501465,-5.7323192956501465,-129.04084104018673,-129.04084104018673,-129.04084104018673,-129.04084104018673,-129.04084104018673,-129.04084104018673,-129.04084104018673,-129.04084104018673,-129.04084104018673,-129.04084104018673,-129.04084104018673,-129.04084104018673,-129.04084104018673,-129.04084104018673,-129.04084104018673,-129.04084104018673,-129.04084104018673,-129.04084104018673,-129.04084104018673,-129.04084104018673,-129.04084104018673,-129.04084104018673,-129.04084104018673,-129.04084104018673,-129.04084104018673,-129.04084104018673,-128.89268859259803,-109.18699797082186,-109.18699797082186,-110.59521791151765]
[null,null,0,0,0,0,0,0,0,0,0,0,0,0,0,0,0,0,0,0,0,0,0,0,0,0,0,0]
[]
[]
[]
[]
[]
[]
[]
[]
[]
[]
[]
[]
[]
[]
[]
[]
[]
[]
[]
[]
[null,null,null,null,null,null,null,"Felsőgépes"]
[null,null,"Fülke oldali terhelés",null,null,null,null,null,null,null,"Ellensúly oldali terhelés"]
[null,"T1","(N)",null,null,null,null,null,null,"T2","(N)"]
[null,null,null,null,"Terhelt fülke","Üres fülke","Terhelt fülke","Üres fülke",null,null,null,"Terhelt fülke","Üres fülke","Terhelt fülke","Üres fülke"]
[]
["T100","Terhelés",null,null,{"$f":"(GQ+GK+GU+GH)/KZU*(g+AKN)","v":19096.182000000001},{"$f":"(GK+GU+GH)/KZU*(g-AKN)","v":6770.2320000000009},{"$f":"IF(csúcs=1,(GQr+GK+GU+GH)/KZU*(g+AKN),(GQ+GK+GU+GH)/KZU*(g+AKN))","v":7497.4320000000007},{"$f":"(GK+GU+GH)/KZU*(g-AKN)","v":6770.2320000000009},"T200","Terhelés",null,{"$f":"((GG+GUe)/KZU)*(g-AKN)","v":11940.075000000001},{"$f":"((GG+GUe)/KZU)*(g+AKN)","v":13222.575000000001},{"$f":"((GG+GUe)/KZU)*(g-AKN)","v":11940.075000000001},{"$f":"((GG+GUe)/KZU)*(g+AKN)","v":13222.575000000001}]
["T130","Kötél",null,null,{"$f":"_GZf1*(g+(AKN*(POWER(KZU,2))+2)/3)","v":0},{"$f":"_GZf1*(g-(AKN*(POWER(KZU,2))+2)/3)","v":0},{"$f":"_GZf1*(g+(AKN*(POWER(KZU,2))+2)/3)","v":0},{"$f":"_GZf1*(g-(AKN*(POWER(KZU,2))+2)/3)","v":0},"T230","kötél",null,{"$f":"_GZe2*(g-(AKN*(POWER(KZU,2))+2)/3)","v":249.91039999999995},{"$f":"_GZe2*(g+(AKN*(POWER(KZU,2))+2)/3)","v":296.31040000000002},{"$f":"_GZe2*(g-(AKN*(POWER(KZU,2))+2)/3)","v":249.91039999999995},{"$f":"_GZe2*(g+(AKN*(POWER(KZU,2))+2)/3)","v":296.31040000000002}]
["T330","Kötél","HT és fülke ",null,{"$f":"GZAf*(-g+AKN)","v":0},{"$f":"GZAf*(-g-AKN)","v":0},{"$f":"GZAf*(-g+AKN)","v":0},{"$f":"GZAf*(-g-AKN)","v":0},"T430","HT és Ells",null,0,0,0,0]
["T120","Kiegyenlitö feszitő tömege",null,null,{"$f":"(GM/(2*KZU))*g","v":0},{"$f":"(GM/(2*KZU))*g","v":0},{"$f":"(GM/(2*KZU))*g","v":0},{"$f":"(GM/(2*KZU))*g","v":0},"T220","Kiegyenlitö feszitő tömege",null,{"$f":"(GM/(2*KZU))*g","v":0},{"$f":"(GM/(2*KZU))*g","v":0},{"$f":"(GM/(2*KZU))*g","v":0},{"$f":"(GM/(2*KZU))*g","v":0}]
["T150","Terelés red. tömege",null,null,{"$f":"IF(NK<>0,((-1)*(IRt*NK*AKN)/KZU),0)","v":0},{"$f":"IF(NK<>0,((IRt*NK*AKN)/KZU),0)","v":0},{"$f":"IF(NK<>0,(-1)*((IRt*NK*AKN)/KZU),0)","v":0},{"$f":"IF(NK<>0,((IRt*NK*AKN)/KZU),0)","v":0},"T250","Terelés red. tömege",null,{"$f":"IF(NG<>0,((-1)*(IRt*NG*AKN)/KZU),0)","v":0},{"$f":"IF(NG<>0,((IRt*NG*AKN)/KZU),0)","v":0},{"$f":"IF(NG<>0,((-1)*(IRt*NG*AKN)/KZU),0)","v":0},{"$f":"IF(NG<>0,((IRt*NG*AKN)/KZU),0)","v":0}]
["T160","A függesztő tárcsa red.tömege",null,null,{"$f":"IF(KZU<>1,(IR*NKk*AKN)/KZU,0)","v":0},{"$f":"IF(KZU<>1,(-1)*(IR*NKk*AKN/KZU),0)","v":0},{"$f":"IF(KZU<>1,(IR*NKk*AKN)/KZU,0)","v":0},{"$f":"IF(KZU<>1,(-1)*(IR*NKk*AKN)/KZU,0)","v":0},"T260","A függesztő tárcsa red.tömege",null,{"$f":"IF(KZU<>1,(-1)*(IRG*NGk*AKN)/KZU,0)","v":0},{"$f":"IF(KZU<>1,(IRG*NGk*AKN)/KZU,0)","v":0},{"$f":"IF(KZU<>1,(-1)*(IRG*NGk*AKN)/KZU,0)","v":0},{"$f":"IF(KZU<>1,(IRG*NGk*AKN)/KZU,0)","v":0}]
["T140","A kiegy.tárcsa red.tömege",null,null,{"$f":"((UU*IRk)/2*KZU)*AKN","v":0},{"$f":"(-1)*((UU*IRk)/2*KZU)*AKN","v":0},{"$f":"((UU*IRk)/2*KZU)*AKN","v":0},{"$f":"(-1)*((UU*IRk)/2*KZU)*AKN","v":0},"T240","A kiegy.tárcsa red.tömege",null,{"$f":"(-1)*((UU*IRk)/2*KZU)*AKN","v":0},{"$f":"((UU*IRk)/2*KZU)*AKN","v":0},{"$f":"(-1)*((UU*IRk)/2*KZU)*AKN","v":0},{"$f":"((UU*IRk)/2*KZU)*AKN","v":0}]
["T170","Surlódási erő fülkén",null,null,{"$f":"(GQ+GK+GH+GU)*TS*g/KZU","v":0},{"$f":"(-1)*(GQ+GK+GH+GU)*TS*g/KZU","v":0},{"$f":"(GQ+GK+GH+GU)*TS*g/KZU","v":0},{"$f":"(GQ+GK+GH+GU)*TS*g/KZU","v":0},"T270","Surlódási erő ellensúlyon",null,{"$f":"(-1)*(GG+GU)*ES*g/KZU","v":0},{"$f":"(GG+GU)*ES*g/KZU","v":0},{"$f":"(-1)*(GG+GU)*ES*g/KZU","v":0},{"$f":"(-1)*(GG+GU)*ES*g/KZU","v":0}]
[null,null,null,null,0,0,0,0]
[null,"Öszesen",null,"F120",{"$f":"SUM(E359:E367)","v":19096.182000000001},{"$f":"E368/L368","v":1.5665467491043918},null,null,null,"Összesen","F220",{"$f":"SUM(L359:L367)","v":12189.985400000001}]
[null,null,null,"F121",null,{"$f":"SUM(F359:F367)","v":6770.2320000000009},{"$f":"M369/F369","v":1.9968127236998672},null,null,null,"F221",null,{"$f":"SUM(M359:M367)","v":13518.885400000001}]
[null,null,null,"F122",null,null,{"$f":"SUM(G359:G367)","v":7497.4320000000007},{"$f":"G370/N370","v":0.61504848069793416},null,null,"F222",null,null,{"$f":"SUM(N359:N367)","v":12189.985400000001}]
[null,null,null,"F123",null,null,null,{"$f":"SUM(H359:H367)","v":6770.2320000000009},{"$f":"IF(H371<O371,O371/H371)","v":1.9968127236998672},null,"F223",null,null,null,{"$f":"SUM(O359:O370)","v":13518.885400000001}]
[]
[]
[]
[]
[]
[]
[]
[]
[]
[null,null,null,null,null,null,null,"Alsógépes"]
[null,"T1","(N)",null,"Fülke terelt",null,"Ellensúly terelt",null,null,"T2","(N)","Fülke terelt",null,"Ellensúly terelt"]
[null,null,null,null,"Terhelt fülke","Üres fülke","Terhelt fülke","Üres fülke",null,null,null,"Terhelt fülke","Üres fülke","Terhelt fülke","Üres fülke"]
[]
["T300","Terhelés",null,null,{"$f":"(GQ+GK+GU+GH)/KZU*(g+AKN)","v":19096.182000000001},{"$f":"(GK+GU+GH)/KZU*(g-AKN)","v":6770.2320000000009},{"$f":"(GQ+GK+GU+GH)/KZU*(g+AKN)","v":19096.182000000001},{"$f":"(GQ+GU+GH)/KZU*(g-AKN)","v":10540.782000000001},"T400","Terhelés",null,{"$f":"((GG+GUe)/KZU)*(g-AKN)","v":11940.075000000001},{"$f":"(GG+GUe/KZU)*(g+AKN)","v":13222.575000000001},{"$f":"((GG+GUe)/KZU)*(g-AKN)","v":11940.075000000001},{"$f":"(GG+GUe/KZU)*(g+AKN)","v":13222.575000000001}]
["T330","Kötél","HT és fülke Kötéltácsa között",null,{"$f":"GZAf*(-g+AKN)","v":0},{"$f":"GZAf*(-g-AKN)","v":0},{"$f":"GZAf*(-g+AKN)","v":0},{"$f":"GZAf*(-g-AKN)","v":0},"T430","HT és Ells.Kötéltácsa között",null,{"$f":"GZAe*(-g-AKN)","v":-287.03039999999999},{"$f":"GZAe*(-g+AKN)","v":-259.19039999999995},{"$f":"GZAe*(-g-AKN)","v":-287.03039999999999},{"$f":"GZAe*(-g+AKN)","v":-259.19039999999995}]
["T331","Kötél","Fülke és kötéltárcsa között",null,{"$f":"_GZf1*(g+(AKN*(POWER(KZU,2))+2)/3)","v":0},{"$f":"_GZf1*(g-(AKN*(POWER(KZU,2))+2)/3)","v":0},{"$f":"_GZf1*(g+(AKN*(POWER(KZU,2))+2)/3)","v":0},{"$f":"_GZf1*(g-(AKN*(POWER(KZU,2))+2)/3)","v":0},"T431","Ellensúly és kötéltárcsa között",null,{"$f":"GZAe*(g-(AKN*(POWER(KZU,2))+2)/3)","v":249.91039999999995},{"$f":"GZAe*(g+(AKN*(POWER(KZU,2))+2)/3)","v":296.31040000000002},{"$f":"GZAe*(g-(AKN*(POWER(KZU,2))+2)/3)","v":249.91039999999995},{"$f":"GZAe*(g+(AKN*(POWER(KZU,2))+2)/3)","v":296.31040000000002}]
["T320","Kiegyenlitö feszitő tömege",null,null,{"$f":"(GM/(2*KZU))*g","v":0},{"$f":"(GM/(2*KZU))*g","v":0},{"$f":"(GM/(2*KZU))*g","v":0},{"$f":"(GM/(2*KZU))*g","v":0},"T420","Kiegyenlitö feszitő tömege",null,{"$f":"(GM/(2*KZU))*g","v":0},{"$f":"(GM/(2*KZU))*g","v":0},{"$f":"(GM/(2*KZU))*g","v":0},{"$f":"(GM/(2*KZU))*g","v":0}]
["T350","Terelés red. tömege",null,null,{"$f":"IF(NK<>0,(IRt*NG*AKN)/KZU,0)","v":0},{"$f":"IF(NK<>0,(-1)*((IRt*NG*AKN)/KZU),0)","v":0},{"$f":"IF(NK<>0,(IRt*NG*AKN)/KZU,0)","v":0},{"$f":"IF(NK<>0,(-1)*((IRt*NG*AKN)/KZU),0)","v":0},"T450","Terelés red. tömege",null,{"$f":"IF(NK<>0,((-1)*(IRt*NG*AKN)/KZU),0)","v":0},{"$f":"IF(NK<>0,((IRt*AKN)/KZU),0)","v":0},{"$f":"IF(NK<>0,((-1)*(IRt*NG*AKN)/KZU),0)","v":0},{"$f":"IF(NK<>0,((IRt*AKN)/KZU),0)","v":0}]
["T360","A függesztő tárcsa red.tömege",null,null,{"$f":"IF(KZU<>1,(IR*NKk*AKN)/KZU,0)","v":0},{"$f":"IF(KZU<>1,(-1)*(IR*NKk*AKN)/KZU,0)","v":0},{"$f":"IF(KZU<>1,(IR*NKk*AKN)/KZU,0)","v":0},{"$f":"IF(KZU<>1,(-1)*(IR*NKk*AKN)/KZU,0)","v":0},"T460","A függesztő tárcsa red.tömege",null,{"$f":"IF(KZU<>1,(-1)*(IRG*NGk*AKN)/KZU,0)","v":0},{"$f":"IF(KZU<>1,(IRG*NGk*AKN)/KZU,0)","v":0},{"$f":"IF(KZU<>1,(-1)*(IRG*NGk*AKN)/KZU,0)","v":0},{"$f":"IF(KZU<>1,(IRG*NGk*AKN)/KZU,0)","v":0}]
["T340","A kiegy.tárcsa red.tömege",null,null,{"$f":"((UU*IRk)/(2*KZU))*AKN","v":0},{"$f":"(-1)*((UU*IRk)/(2*KZU))*AKN","v":0},{"$f":"((UU*IRk)/(2*KZU))*AKN","v":0},{"$f":"(-1)*((UU*IRk)/(2*KZU))*AKN","v":0},"T440","A kiegy.tárcsa red.tömege",null,{"$f":"(-1)*((UU*IRk)/(2*KZU))*AKN","v":0},{"$f":"((UU*IRk)/(2*KZU))*AKN","v":0},{"$f":"(-1)*((UU*IRk)/(2*KZU))*AKN","v":0},{"$f":"((UU*IRk)/(2*KZU))*AKN","v":0}]
["T370","Surlódási erő fülkén",null,null,{"$f":"(-1)*(GQ+GK+GH+GU)*TS*g/KZU","v":0},{"$f":"(GQ+GK+GH+GU)*TS*g/KZU","v":0},{"$f":"(-1)*(GQ+GK+GH+GU)*TS*g/KZU","v":0},{"$f":"(GQ+GK+GH+GU)*TS*g/KZU","v":0},"T270","Surlódási erő ellensúlyon",null,{"$f":"(-1)*(GG+GU)*ES*g/KZU","v":0},{"$f":"(GG+GU)*ES*g/KZU","v":0},{"$f":"(-1)*(GG+GU)*ES*g/KZU","v":0},{"$f":"(GG+GU)*ES*g/KZU","v":0}]
[null,null,null,null,0,0,0,0]
[null,"Öszesen",null,"F320",{"$f":"SUM(E385:E393)","v":19096.182000000001},{"$f":"E394/L394","v":1.6043227921133867},null,null,null,"Összesen","F420",{"$f":"SUM(L385:L393)","v":11902.955000000002}]
[null,null,null,"F321",null,{"$f":"SUM(F385:F393)","v":6770.2320000000009},{"$f":"IF(F395<M395,POWER(F395/M395,-1))","v":1.9585288953170288},null,null,null,"F421",null,{"$f":"SUM(M385:M394)","v":13259.695000000002}]
[null,null,null,"F322",null,null,{"$f":"SUM(G385:G393)","v":19096.182000000001},{"$f":"G396/N396","v":1.6043227921133867},null,null,"F422",null,null,{"$f":"SUM(N385:N393)","v":11902.955000000002}]
[null,null,null,"F323",null,null,null,{"$f":"SUM(H385:H393)","v":10540.782000000001},{"$f":"IF(H397<O397,POWER(H397/O397,-1))","v":1.2579422475486164},null,"F423",null,null,null,{"$f":"SUM(O385:O396)","v":13259.695000000002}]
[]
["T100","(GQ+GK+GU+GH)/KZU*(g+AKN)",null,null,null,null,null,null,"T200","((GG+GUe)/KZU)*(g-AKN)"]
["T130","GZ*(g-(AKN*(HATVÁNY(KZU;2))+2)/3)",null,null,null,null,null,null,"T230","GZe*(g-(AKN*(HATVÁNY(KZU;2))+2)/3)"]
["T120","(GM/(2*KZU))*g",null,null,null,null,null,null,"T220","(GM/(2*KZU))*g"]
["T150","HA(TERM=2;((-1)*(IRt*NK*AKN)/KZU);0)",null,null,null,null,null,null,"T250","HA(TERM=2;((-1)*(IRt*NG*AKN)/KZU);0)"]
["T160","HA(KZU<>1;(IR*NKk*AKN)/KZU;0)",null,null,null,null,null,null,"T260","HA(KZU<>1;(-1)*(IRG*NGk*AKN)/KZU;0)"]
["T140","((UU*IRk)/2*KZU)*AKN",null,null,null,null,null,null,"T240","(-1)*((UU*IRk)/2*KZU)*AKN"]
["T170","(-1)*(GQ+GK+GH+GU)*TS*g/KZU",null,null,null,null,null,null,"T270","(-1)*(GG+GU)*ES*g/KZU"]
["T370","(-1)*(GQ+GK+GH+GU)*TS*g/KZU"]
[]
["T300","(GQ+GK+GU+GH)/KZU*(g+AKN)",null,null,null,null,null,null,"T400","((GG+GUe)/KZU)*(g-AKN)"]
["T330","GZAf*(-g+AKN)",null,null,null,null,null,null,"T430","GZAe*(-g-AKN)"]
["T331","GZ*(g+(AKN*(HATVÁNY(KZU;2))+2)/3)",null,null,null,null,null,null,"T431","GZe*(g-(AKN*(HATVÁNY(KZU;2))+2)/3)"]
["T320","(GM/(2*KZU))*g",null,null,null,null,null,null,"T420","(GM/(2*KZU))*g"]
["T350","HA(TERM=2;(IRt*NG*AKN)/KZU;0)",null,null,null,null,null,null,"T450","HA(TERM=2;((-1)*(IRt*NG*AKN)/KZU);0)"]
["T360","HA(KZU<>1;(IR*NKk*AKN)/KZU;0)",null,null,null,null,null,null,"T460","HA(KZU<>1;(-1)*(IRG*NGk*AKN)/KZU;0)"]
["T340","((UU*IRk)/(2*KZU))*AKN",null,null,null,null,null,null,"T440","(-1)*((UU*IRk)/(2*KZU))*AKN"]
["T370","(GQ+GK+GH+GU)*TS*g/KZU",null,null,null,null,null,null,"T270","(-1)*(GG+GU)*ES*g/KZU"]
[]
[]
[null,null,null,null,null,null,null,"Felsőgépes"]
["Fülke oldali terhelés",null,null,null,null,null,null,null,"Ellensúly oldali terhelés"]
[null,"T1","(N)",null,"Fülke terelt",null,"Ellensúly terelt",null,null,"T2","(N)","Fülke terelt",null,"Ellensúly terelt"]
[null,null,null,null,"Terhelt fülke","Üres fülke","Terhelt fülke","Üres fülke",null,null,null,"Terhelt fülke","Üres fülke","Terhelt fülke","Üres fülke"]
[]
["T500","Terhelés",null,null,{"$f":"(GQ+GK+GU+GH)/KZU*(g-AKN)","v":17243.982},{"$f":"(GK+GU+GH)/KZU*(g+AKN)","v":7497.4320000000007},{"$f":"(GQ+GK+GU+GH)/KZU*(g-AKN)","v":17243.982},{"$f":"(GK+GU+GH)/KZU*(g+AKN)","v":7497.4320000000007},"T600","Terhelés",null,{"$f":"((GG+GUe)/KZU)*(g-AKN)","v":11940.075000000001},{"$f":"((GG+GUe)/KZU)*(g+AKN)","v":13222.575000000001},{"$f":"((GG+GUe)/KZU)*(g-AKN)","v":11940.075000000001},{"$f":"((GG+GUe)/KZU)*(g+AKN)","v":13222.575000000001}]
["T530","Kötél",null,null,{"$f":"_GZf1*(g-(AKN*(POWER(KZU,2))+2)/3)","v":0},{"$f":"_GZf1*(g+(AKN*(POWER(KZU,2))+2)/3)","v":0},{"$f":"_GZf1*(g--(AKN*(POWER(KZU,2))+2)/3)","v":0},{"$f":"_GZf1*(g+(AKN*(POWER(KZU,2))+2)/3)","v":0},"T630","kötél",null,{"$f":"_GZe2*(g-(AKN*(POWER(KZU,2))+2)/3)","v":249.91039999999995},{"$f":"_GZe2*(g+(AKN*(POWER(KZU,2))+2)/3)","v":296.31040000000002},{"$f":"_GZe2*(g-(AKN*(POWER(KZU,2))+2)/3)","v":249.91039999999995},{"$f":"_GZe2*(g+(AKN*(POWER(KZU,2))+2)/3)","v":296.31040000000002}]
["T520","Kiegyenlitö feszitő tömege",null,null,{"$f":"(GM/(2*KZU))*g","v":0},{"$f":"(GM/(2*KZU))*g","v":0},{"$f":"(GM/(2*KZU))*g","v":0},{"$f":"(GM/(2*KZU))*g","v":0},"T620","Kiegyenlitö feszitő tömege",null,{"$f":"(GM/(2*KZU))*g","v":0},{"$f":"(GM/(2*KZU))*g","v":0},{"$f":"(GM/(2*KZU))*g","v":0},{"$f":"(GM/(2*KZU))*g","v":0}]
["T550","Terelés red. tömege",null,null,{"$f":"IF(TERM=2,((-1)*(IRt*NK*AKN)/KZU),0)","v":0},{"$f":"IF(TERM=2,((IRt*AKN)/KZU),0)","v":0},{"$f":"IF(TERM=1,(-1)*((IRt*AKN)/KZU),0)","v":0},{"$f":"IF(TERM=1,((IRt*AKN)/KZU),0)","v":0},"T650","Terelés red. tömege",null,{"$f":"IF(TERM=2,((-1)*(IRt*NG*AKN)/KZU),0)","v":0},{"$f":"IF(TERM=2,((-1)*(IRt*AKN)/KZU),0)","v":0},{"$f":"IF(TERM=1,((-1)*(IRt*AKN)/KZU),0)","v":0},{"$f":"IF(TERM=1,((-1)*(IRt*AKN)/KZU),0)","v":0}]
["T560","A függesztő tárcsa red.tömege",null,null,{"$f":"IF(KZU<>1,(IR*NKk*AKN)/KZU,0)","v":0},{"$f":"IF(KZU<>1,(-1)*(IR*NKk*AKN/KZU),0)","v":0},{"$f":"IF(KZU<>1,(IR*NKk*AKN)/KZU,0)","v":0},{"$f":"IF(KZU<>1,(-1)*(IR*NKk*AKN)/KZU,0)","v":0},"T660","A függesztő tárcsa red.tömege",null,{"$f":"IF(KZU<>1,(-1)*(IRG*NGk*AKN)/KZU,0)","v":0},{"$f":"IF(KZU<>1,(IRG*NGk*AKN)/KZU,0)","v":0},{"$f":"IF(KZU<>1,(-1)*(IRG*NGk*AKN)/KZU,0)","v":0},{"$f":"IF(KZU<>1,(IRG*NGk*AKN)/KZU,0)","v":0}]
["T540","A kiegy.tárcsa red.tömege",null,null,{"$f":"((UU*IRk)/2*KZU)*AKN","v":0},{"$f":"(-1)*((UU*IRk)/2*KZU)*AKN","v":0},{"$f":"((UU*IRk)/2*KZU)*AKN","v":0},{"$f":"(-1)*((UU*IRk)/2*KZU)*AKN","v":0},"T640","A kiegy.tárcsa red.tömege",null,{"$f":"(-1)*((UU*IRk)/2*KZU)*AKN","v":0},{"$f":"((UU*IRk)/2*KZU)*AKN","v":0},{"$f":"(-1)*((UU*IRk)/2*KZU)*AKN","v":0},{"$f":"((UU*IRk)/2*KZU)*AKN","v":0}]
["T570","Surlódási erő fülkén",null,null,{"$f":"(GQ+GK+GH+GU)*TS*g/KZU","v":0},{"$f":"(-1)*(GQ+GK+GH+GU)*TS*g/KZU","v":0},{"$f":"(GQ+GK+GH+GU)*TS*g/KZU","v":0},{"$f":"(-1)*(GQ+GK+GH+GU)*TS*g/KZU","v":0},"T670","Surlódási erő ellensúlyon",null,{"$f":"(GG+GU)*ES*g/KZU","v":0},{"$f":"(-1)*(GG+GU)*ES*g/KZU","v":0},{"$f":"(GG+GU)*ES*g/KZU","v":0},{"$f":"(-1)*(GG+GU)*ES*g/KZU","v":0}]
[null,null,null,null,0,0,0,0]
[null,"Öszesen",null,"F520",{"$f":"SUM(E423:E430)","v":17243.982},{"$f":"E431/L431","v":1.4146023505491645},null,null,null,"Összesen","F620",{"$f":"SUM(L423:L430)","v":12189.985400000001}]
[null,null,null,"F521",null,{"$f":"SUM(F423:F430)","v":7497.4320000000007},{"$f":"M432/F432","v":1.8031354469103553},null,null,null,"F621",null,{"$f":"SUM(M423:M430)","v":13518.885400000001}]
[null,null,null,"F522",null,null,{"$f":"SUM(G423:G430)","v":17243.982},{"$f":"G433/N433","v":1.4146023505491645},null,null,"F622",null,null,{"$f":"SUM(N423:N430)","v":12189.985400000001}]
[null,null,null,"F523",null,null,null,{"$f":"SUM(H423:H430)","v":7497.4320000000007},{"$f":"IF(H434<O434,O434/H434)","v":1.8031354469103553},null,"F623",null,null,null,{"$f":"SUM(O423:O433)","v":13518.885400000001}]
[]
[]
[]
[]
[]
[]
[]
[]
[]
[]
[]
[]
[]
[]
[]
[]
[]
[]
[]
[]
[]
[]
[]
[]
[]
[]
[]
[]
[]
[]
[]
[]
[]
[]
[]
[]
[]
[]
[]
[]
[]
[]
[]
[]
[]
[]
[]
[]
[]
[]
[]
[]
[]
[]
[]
[]
[]
[]
[]
[]
[]
[]
[]
[]
[]
[]
[]
[]
[]
[null,null,null,null,null,0,0,0,0,0,0,0]
[null,null,null,null,null,0,0,0,0,0,0,0]
[null,null,null,null,null,0,0,0,0,0,0,0]
[null,null,null,null,null,0,0,0,0,0,0,0]
[null,null,null,null,null,0,0,0,0,0,0,0]
[null,null,null,null,null,0,0,0,0,0,0,0]
[null,null,null,null,null,0,0,0,0,0,0,0]
[null,null,null,null,null,0,0,0,0,0,0,0]
[null,null,null,null,null,0,0,0,0,0,0,0]
[null,null,null,null,null,0,0,0,0,0,0,0]
[null,null,null,null,null,0,0,0,0,0,0,0]
[null,null,null,null,null,0,0,0,0,0,0,0]
[null,null,null,null,null,0,0,0,0,0,0,0]
[null,null,null,null,null,0,0,0,0,0,0,0]
[null,null,null,null,null,0,0,0,0,0,0,0]
[null,null,null,null,null,0,0,0,0,0,0,0]
[null,null,null,null,null,0,0,0,0,0,0,0]
[null,null,null,null,null,0,0,0,0,0,0,0]
[null,null,null,null,null,0,0,0,0,0,0,0]
[null,null,null,null,null,0,0,0,0,0,0,0]
[null,null,null,null,null,0,0,0,0,0,0,0]
[null,null,null,null,null,0,0,0,0,0,0,0]
[null,null,null,null,null,0,0,0,0,0,0,0]
[null,null,null,null,null,0,0,0,0,0,0,0]
[null,null,null,null,null,0,0,0,0,0,0,0]
[null,null,null,null,null,0,0,0,0,0,0,0]
[null,null,null,null,null,0,0,0,0,0,0,0]
[null,null,null,null,null,0,0,0,0,0,0,0]
[null,null,null,null,null,0,0,0,0,0,0,0]
[null,null,null,null,null,0,0,0,0,0,0,0]
[null,null,null,null,null,0,0,0,0,0,0,0]
[null,null,null,null,null,0,0,0,0,0,0,0]
[null,null,null,null,null,0,0,0,0,0,0,0]
[null,null,null,null,null,0,0,0,0,0,0,0]
[null,null,null,null,null,0,0,0,0,0,0,0]
[null,null,null,null,null,0,0,0,0,0,0,0]
[null,null,null,null,null,0,0,0,0,0,0,0]
[null,null,null,null,null,0,0,0,0,0,0,0]
[null,null,null,null,null,0,0,0,0,0,0,0]
[null,null,null,null,null,0,0,0,0,0,0,0]
[null,null,null,null,null,0,0,0,0,0,0,0]
[null,null,null,null,null,0,0,0,0,0,0,0]
[null,null,null,null,null,0,0,0,0,0,0,0]
[null,null,null,null,null,0,0,0,0,0,0,0]
[null,null,null,null,null,0,0,0,0,0,0,0]
[null,null,null,null,null,0,0,0,0,0,0,0]
[null,null,null,null,null,0,0,0,0,0,0,0]
[null,null,null,null,null,0,0,0,0,0,0,0]
[null,null,null,null,null,0,0,0,0,0,0,0]
[null,null,null,null,null,0,0,0,0,0,0,0]
[null,null,null,null,null,0,0,0,0,0,0,0]
[null,null,null,null,null,0,0,0,0,0,0,0]
[null,null,null,null,null,0,0,0,0,0,0,0]
[null,null,null,null,null,0,0,0,0,0,0,0]
[null,null,null,null,null,0,0,0,0,0,0,0]
[null,null,null,null,null,0,0,0,0,0,0,0]
[null,null,null,null,null,0,0,0,0,0,0,0]
[null,null,null,null,null,0,0,0,0,0,0,0]
[null,null,null,null,null,0,0,0,0,0,0,0]
[null,null,null,null,null,0,0,0,0,0,0,0]
[null,null,null,null,null,0,0,0,0,0,0,0]
[null,null,null,null,null,0,0,0,0,0,0,0]
[null,null,null,null,null,0,0,0,0,0,0,0]
[null,null,null,null,null,0,0,0,0,0,0,0]
[null,null,null,null,null,0,0,0,0,0,0,0]
[null,null,null,null,null,0,0,0,0,0,0,0]
[null,null,null,null,null,0,0,0,0,0,0,0]
[null,null,null,null,null,0,0,0,0,0,0,0]
[null,null,null,null,null,0,0,0,0,0,0,0]
[null,null,null,null,null,0,0,0,0,0,0,0]
[null,null,null,null,null,0,0,0,0,0,0,0]
[null,null,null,null,null,0,0,0,0,0,0,0]
[null,null,null,null,null,0,0,0,0,0,0,0]
[null,null,null,null,null,0,0,0,0,0,0,0]
[null,null,null,null,null,0,0,0,0,0,0,0]
[null,null,null,null,null,0,0,0,0,0,0,0]
[null,null,null,null,null,0,0,0,0,0,0,0]
[null,null,null,null,null,0,0,0,0,0,0,0]
[null,null,null,null,null,0,0,0,0,0,0,0]
[null,null,null,null,null,0,0,0,0,0,0,0]
[null,null,null,null,null,0,0,0,0,0,0,0]
[null,null,null,null,null,0,0,0,0,0,0,0]
[null,null,null,null,null,0,0,0,0,0,0,0]
[null,null,null,null,null,0,0,0,0,0,0,0]
[null,null,null,null,null,0,0,0,0,0,0,0]
[null,null,null,null,null,0,0,0,0,0,0,0]
[null,null,null,null,null,0,0,0,0,0,0,0]
[null,null,null,null,null,0,0,0,0,0,0,0]
[null,null,null,null,null,0,0,0,0,0,0,0]
[null,null,null,null,null,0,0,0,0,0,0,0]
[null,null,null,null,null,0,0,0,0,0,0,0]
[null,null,null,null,null,0,0,0,0,0,0,0]
[null,null,null,null,null,0,0,0,0,0,0,0]
[null,null,null,null,null,0,0,0,0,0,0,0]
[null,null,null,null,null,0,0,0,0,0,0,0]
[null,null,null,null,null,0,0,0,0,0,0,0]
[null,null,null,null,null,0,0,0,0,0,0,0]
[null,null,null,null,null,0,0,0,0,0,0,0]
[null,null,null,null,null,0,0,0,0,0,0,0]
[null,null,null,null,null,0,0,0,0,0,0,0]
[null,null,null,null,null,0,0,0,0,0,0,0]
[null,null,null,null,null,0,0,0,0,0,0,0]
[null,null,null,null,null,0,0,0,0,0,0,0]
[null,null,null,null,null,0,0,0,0,0,0,0]
[null,null,null,null,null,0,0,0,0,0,0,0]
[null,null,null,null,null,0,0,0,0,0,0,0]
[null,null,null,null,null,0,null,null,0,0,0,0]
[null,null,null,null,null,0,0,0,0,0,0,0]
[null,null,null,null,null,0,0,0,0,0,0,0]
[null,null,null,null,null,0,0,0,0,0,0,0]
[null,null,null,null,null,0,0,0,0,0,0,0]
[null,null,null,null,null,0,0,0,0,0,0,0]
[null,null,null,null,null,0,0,0,0,0,0,0]
[null,null,null,null,null,0,0,0,0,0,0,0]
[null,null,null,null,null,0,0,0,0,0,0,0]
[null,null,null,null,null,0,0,0,0,0,0,0]
[null,null,null,null,null,0,0,0,0,0,0,0]
[null,null,null,null,null,0,0,0,0,0,0,0]
[null,null,null,null,null,0,0,0,0,0,0,0]
[null,null,null,null,null,0,0,0,0,0,0,0]
[null,null,null,null,null,0,0,0,0,0,0,0]
[null,null,null,null,null,0,0,0,0,0,0,0]
[null,null,null,null,null,0,0,0,0,0,0,0]
[null,null,null,null,null,0,0,0,0,0,0,0]
[null,null,null,null,null,0,0,0,0,0,0,0]
[null,null,null,null,null,0,0,0,0,0,0,0]
[null,null,null,null,null,0,0,0,0,0,0,0]
[null,null,null,null,null,0,0,0,0,0,0,0]
[null,null,null,null,null,0,0,0,0,0,0,0]
[null,null,null,null,null,0,0,0,0,0,0,0]
[null,null,null,null,null,0,0,0,0,0,0,0]
[null,null,null,null,null,0,0,0,0,0,0,0]
[null,null,null,null,null,0,0,0,0,0,0,0]
[null,null,null,null,null,0,0,0,0,0,0,0]
[null,null,null,null,null,0,0,0,0,0,0,0]
[null,null,null,null,null,0,0,0,0,0,0,0]
[null,null,null,null,null,0,0,0,0,0,0,0]
[null,null,null,null,null,0,0,0,0,0,0,0]
[null,null,null,null,null,0,0,0,0,0,0,0]
[null,null,null,null,null,0,0,0,0,0,0,0]
[null,null,null,null,null,0,0,0,0,0,0,0]
[null,null,null,null,null,0,0,0,0,0,0,0]
[null,null,null,null,null,0,0,0,0,0,0,0]
[null,null,null,null,null,0,0,0,0,0,0,0]
[null,null,null,null,null,0,0,0,0,0,0,0]
[null,null,null,null,null,0,0,0,0,0,0,0]
[null,null,null,null,null,0,0,0,0,0,0,0]
[null,null,null,null,null,0,0,0,0,0,0,0]
[null,null,null,null,null,0,0,0,0,0,0,0]
[null,null,null,null,null,0,0,0,0,0,0,0]
[null,null,null,null,null,0,0,0,0,0,0,0]
[null,null,null,null,null,0,0,0,0,0,0,0]
[null,null,null,null,null,0,0,0,0,0,0,0]
[null,null,null,null,null,0,0,0,0,0,0,0]
[null,null,null,null,null,0,0,0,0,0,0,0]
[null,null,null,null,null,0,0,0,0,0,0,0]
[null,null,null,null,null,0,0,0,0,0,0,0]
[null,null,null,null,null,0,0,0,0,0,0,0]
[null,null,null,null,null,0,0,0,0,0,0,0]
[null,null,null,null,null,0,0,0,0,0,0,0]
[null,null,null,null,null,0,0,0,0,0,0,0]
[null,null,null,null,null,0,0,0,0,0,0,0]
[null,null,null,null,null,0,0,0,0,0,0,0]
[null,null,null,null,null,0,0,0,0,0,0,0]
[null,null,null,null,null,0,0,0,0,0,0,0]
[null,null,null,null,null,0,0,0,0,0,0,0]
[null,null,null,null,null,0,0,0,0,0,0,0]
[null,null,null,null,null,0,0,0,0,0,0,0]
[null,null,null,null,null,0,0,0,0,0,0,0]
[null,null,null,null,null,0,0,0,0,0,0,0]
[null,null,null,null,null,0,0,0,0,0,0,0]
[null,null,null,null,null,0,0,0,0,0,0,0]
[null,null,null,null,null,0,0,0,0,0,0,0]
[null,null,null,null,null,0,0,0,0,0,0,0]
[null,null,null,null,null,0,0,0,0,0,0,0]
[null,null,null,null,null,0,0,0,0,0,0,0]
[null,null,null,null,null,0,0,0,0,0,0,0]
[null,null,null,null,null,0,0,0,0,0,0,0]
[null,null,null,null,null,0,0,0,0,0,0,0]
[null,null,null,null,null,0,0,0,0,0,0,0]
[null,null,null,null,null,0,0,0,0,0,0,0]
[null,null,null,null,null,0,0,0,0,0,0,0]
[null,null,null,null,null,0,0,0,0,0,0,0]
[null,null,null,null,null,0,0,0,0,0,0,0]
[null,null,null,null,null,0,0,0,0,0,0,0]
[null,null,null,null,null,0,0,0,0,0,0,0]
[null,null,null,null,null,0,0,0,0,0,0,0]
[null,null,null,null,null,0,0,0,0,0,0,0]
[null,null,null,null,null,0,0,0,0,0,0,0]
[null,null,null,null,null,0,0,0,0,0,0,0]
[null,null,null,null,null,0,0,0,0,0,0,0]
[null,null,null,null,null,0,0,0,0,0,0,0]
[null,null,null,null,null,0,0,0,0,0,0,0]
[null,null,null,null,null,0,0,0,0,0,0,0]
[null,null,null,null,null,0,0,0,0,0,0,0]
[null,null,null,null,null,0,0,0,0,0,0,0]
[null,null,null,null,null,0,0,0,0,0,0,0]
[null,null,null,null,null,0,0,0,0,0,0,0]
[null,null,null,null,null,0,0,0,0,0,0,0]
[null,null,null,null,null,0,0,0,0,0,0,0]
[null,null,null,null,null,0,0,0,0,0,0,0]
[null,null,null,null,null,0,0,0,0,0,0,0]
[null,null,null,null,null,0,0,0,0,0,0,0]
[null,null,null,null,null,0,0,0,0,0,0,0]
[null,null,null,null,null,0,0,0,0,0,0,0]
[null,null,null,null,null,0,0,0,0,0,0,0]
[null,null,null,null,null,0,0,0,0,0,0,0]
[null,null,null,null,null,0,0,0,0,0,0,0]
[null,null,null,null,null,0,0,0,0,0,0,0]
[null,null,null,null,null,0,0,0,0,0,0,0]
[null,null,null,null,null,0,0,0,0,0,0,0]
[null,null,null,null,null,0,0,0,0,0,0,0]
[null,null,null,null,null,0,0,0,0,0,0,0]
[null,null,null,null,null,0,0,0,0,0,0,0]
[null,null,null,null,null,0,0,0,0,0,0,0]
[null,null,null,null,null,0,0,0,0,0,0,0]
[null,null,null,null,null,0,0,0,0,0,0,0]
[null,null,null,null,null,0,0,0,0,0,0,0]
[null,null,null,null,null,0,0,0,0,0,0,0]
[null,null,null,null,null,0,0,0,0,0,0,0]
[null,null,null,null,null,0,0,0,0,0,0,0]
[null,null,null,null,null,0,0,0,0,0,0,0]
[null,null,null,null,null,0,0,0,0,0,0,0]
[null,null,null,null,null,0,0,0,0,0,0,0]
[null,null,null,null,null,0,0,0,0,0,0,0]
[null,null,null,null,null,0,0,0,0,0,0,0]
[null,null,null,null,null,0,0,0,0,0,0,0]
[null,null,null,null,null,0,0,0,0,0,0,0]
[null,null,null,null,null,0,0,0,0,0,0,0]
[null,null,null,null,null,0,0,0,0,0,0,0]
[null,null,null,null,null,0,0,0,0,0,0,0]
[null,null,null,null,null,0,0,0,0,0,0,0]
[null,null,null,null,null,0,0,0,0,0,0,0]
[null,null,null,null,null,0,0,0,0,0,0,0]
[null,null,null,null,null,0,0,0,0,0,0,0]
[null,null,null,null,null,0,0,0,0,0,0,0]
[null,null,null,null,null,0,0,0,0,0,0,0]
[null,null,null,null,null,0,0,0,0,0,0,0]
[null,null,null,null,null,0,0,0,0,0,0,0]
[null,null,null,null,null,0,0,0,0,0,0,0]
[null,null,null,null,null,0,0,0,0,0,0,0]
[null,null,null,null,null,0,0,0,0,0,0,0]
[null,null,null,null,null,0,0,0,0,0,0,0]
[null,null,null,null,null,0,0,0,0,0,0,0]
[null,null,null,null,null,0,0,0,0,0,0,0]
[null,null,null,null,null,0,0,0,0,0,0,0]
[null,null,null,null,null,0,0,0,0,0,0,0]
[null,null,null,null,null,0,0,0,0,0,0,0]
[null,null,null,null,null,0,0,0,0,0,0,0]
[null,null,null,null,null,0,0,0,0,0,0,0]
[]
[]
[]
[]
[]
[]
[]
[]
[]
[]
[]
[]
[]
[]
[]
[]
[]
[]
[]
[]
[]
[]
[]
[]
[]
[]
[]
[]
[]
[]
[]
[]
[]
[]
[]
[]
[]
[]
[]
[]
[]
[]
[]
[]
[]
[]
[]
[]
[]
[]
[]
[]
[]
[]
[]
[]
[]
[]
[]
[]
[]
[]
[]
[]
[]
[]
[]
[]
[]
[]
[]
[]
[]
[]
[]
[]
[]
[]
[]
[]
[]
[]
[]
[]
[]
[]
[]
[]
[]
[]
[]
[]
[]
[]
[]
[]
[]
[]
[]
[]
[]
[]
[]
[]
[]
[]
[]
[]
[]
[]
[]
[]
[]
[]
[]
[]
[]
[]
[]
[]
[]
[]
[]
[]
[]
[]
[]
[]
[]
[]
[]
[]
[]
[]
[]
[]
[]
[]
[]
[]
[]
[]
[]
[]
[]
[]
[]
[]
[]
[]
[]
[]
[]
[]
[]
[]
[]
[]
[]
[]
[]
[]
[]
[]
[]
[]
[]
[]
[]
[]
[]
[]
[]
[]
[]
[]
[]
[]
[]
[]
[]
[]
[]
[]
[]
[]
[]
[]
[]
[]
[]
[]
[]
[]
[]
[]
[]
[]
[]
[]
[]
[]
[]
[]
[]
[]
[]
[]
[]
[]
[]
[]
[]
[]
[]
[]
[]
[]
[]
[]
[]
[]
[]
[]
[]
[]
[]
[]
[]
[]
[]
[]
[]
[]
[]
[]
[]
[]
[]
[]
[]
[]
[]
[]
[]
[]
[]
[]
[]
[]
[]
[]
[]
[]
[]
[]
[]
[]
[]
[]
[]
[]
[]
[]
[]
[]
[]
[]
[]
[]
[]
[]
[]
[]
[]
[]
[]
[]
[]
[]
[]
[]
[]
[]
[]
[]
[]
[]
[]
[]
[]
[]
[]
[]
[]
[]
[]
[]
[]
[]
[]
[]
[]
[]
[]
[]
[]
[]
[]
[]
[]
[]
[]
[]
[]
[]
[]
[]
[]
[]
[]
[]
[]
[]
[]
[]
[]
[]
[]
[]
[]
[]
[]
[]
[]
[]
[]
[]
[]
[]
[]
[]
[]
[]
[]
[]
[]
[]
[]
[]
[]
[]
[]
[]
[]
[]
[]
[]
[]
[]
[]
[]
[]
[]
[]
[]
[]
[]
[]
[]
[]
[]
[]
[]
[]
[]
[]
[]
[]
[]
[]
[]
[]
[]
[]
[]
[]
[]
[]
[]
[]
[]
[]
[]
[]
[]
[]
[]
[]
[]
[]
[]
[]
[]
[]
[]
[]
[]
[]
[]
[]
[]
[]
[]
[]
[]
[]
[]
[]
[]
[]
[]
[]
[]
[]
[]
[]
[]
[]
[]
[]
[]
[]
[]
[]
[]
[]
[]
[]
[]
[]
[]
[]
[]
[]
[]
[]
[]
[]
[]
[]
[]
[]
[]
[]
[]
[]
[]
[]
[]
[]
[]
[]
[]
[]
[]
[]
[]
[]
[]
[]
[]
[]
[]
[]
[]
[]
[]
[]
[]
[]
[]
[]
[]
[]
[]
[]
[]
[]
[]
[]
[]
[]
[]
[]
[]
[]
[]
[]
[]
[]
[]
[]
[]
[]
[]
[]
[]
[]
[]
[]
[]
[]
[]
[]
[]
[]
[]
[]
[]
[]
[]
[]
[]
[]
[]
[]
[]
[]
[]
[]
[]
[]
[]
[]
[]
[]
[]
[]
[]
[]
[]
[]
[]
[]
[]
[]
[]
[]
[]
[]
[]
[]
[]
[]
[]
[]
[]
[]
[]
[]
[]
[]
[]
[]
[]
[]
[]
[]
[]
[]
[]
[]
[]
[]
[]
[]
[]
[]
[]
[]
[]
[]
[]
[]
[]
[]
[]
[]
[]
[]
[]
[]
[]
[]
[]
[]
[]
[]
[]
[]
[]
[]
[]
[]
[]
[]
[]
[]
[]
[]
[]
[]
[]
[]
[]
[]
[]
[]
[]
[]
[]
[]
[]
[]
[]
[]
[]
[]
[]
[]
[]
[]
[]
[]
[]
[]
[]
[]
[]
[]
[]
[]
[]
[]
[]
[]
[]
[]
[]
[]
[]
[]
[]
[]
[]
[]
[]
[]
[]
[]
[]
[]
[]
[]
[]
[]
[]
[]
[]
[]
[]
[]
[]
[]
[]
[]
[]
[]
[]
[]
[]
[]
[]
[]
[]
[]
[]
[]
[]
[]
[]
[]
[]
[]
[]
[]
["Ezt már nem kell kinyomtatni!"]
[{"$f":"SIGN(#REF!)","v":{"$error":"#REF!"}},{"$f":"IF(A1452=0,1,A1452)","v":{"$error":"#REF!"}},null,null,"<","Ne töröld ki ezeket !",null,">"]
[]
[null,null,"Sínerők FFx","Legnagyobb:",null,"Sínerők FFy","Legnagyobb:"]
[null,null,{"$f":"#REF!","v":{"$error":"#REF!"}},null,null,{"$f":"H420","v":0}]
[null,null,{"$f":"#REF!","v":{"$error":"#REF!"}},{"$f":"IF(C1456>C1455,C1456,C1455)","v":{"$error":"#REF!"}},null,{"$f":"H461","v":0},{"$f":"IF(F1456>F1455,F1456,F1455)","v":0}]
[null,null,{"$f":"H449","v":0},{"$f":"IF(C1457>D1456,C1457,D1456)","v":{"$error":"#REF!"}},null,{"$f":"H501","v":0},{"$f":"IF(F1457>G1456,F1457,G1456)","v":0}]
[null,null,{"$f":"H457","v":0},{"$f":"IF(C1458>D1457,C1458,D1457)","v":{"$error":"#REF!"}},null,{"$f":"H561","v":0},{"$f":"IF(F1458>G1457,F1458,G1457)","v":0}]
[null,null,{"$f":"H484","v":0},{"$f":"IF(C1459>D1458,C1459,D1458)","v":{"$error":"#REF!"}}]
[null,null,{"$f":"H497","v":0},{"$f":"IF(C1460>D1459,C1460,D1459)","v":{"$error":"#REF!"}}]
[null,null,{"$f":"H557","v":0},{"$f":"IF(C1461>D1460,C1461,D1460)","v":{"$error":"#REF!"}}]
[]
["Sínprofilok:"]
["ssz.","ISO-kód","méret",null,"AF","IFX","IFY","WFX","WFY"]
[1,"T 45/A","45x45x5",null,425,80800,38400,2530,1710]
[2,"T 50/A","50x50x5",null,475,112400,52500,3150,2100]
[3,"T 70-2/A","70x70x8",null,1052,474300,221300,9630,6610]
[4,"T 70-1/A","70x65x9",null,951,413000,186500,9240,5350]
[5,"T 75-3/A","75x62x10",null,1099,403500,264900,9290,7060]
[6,"T 75-3/B","75x62x10",null,1099,403500,264900,9290,7060]
[7,"T 82/A","82,5x68,25x9",null,1090,494000,305000,10200,7400]
[8,"T 89/A","89x62x15,88",null,1570,595200,524000,14250,11800]
[9,"T 89/B","89x62x15,88",null,1570,595200,524000,14250,11800]
[10,"T 90/A","90x75x16",null,1725,1020000,526000,20870,11800]
[11,"T 90/B","90x75x16",null,1725,1020000,526000,20870,11800]
[12,"T 125/B","125x82x16",null,2283,1510000,1590000,26200,25400]
[13,"T 127-1/B","127x89x15,88",null,2264,1862000,1480000,30400,23400]
[14,"T 127-2/B","127x89x15,89",null,2863,1984000,2300000,30900,36200]
[15,"T 140-1/B","140x108x19",null,3520,4040000,3100000,53400,44300]
[16,"( V0 ) (A)","50x50x6",null,568,121000,60600,3360,2420]
[17,"( V1 ) (B)","60x50x10",null,760,191000,93000,5800,3100]
[18,"( V2 ) (B)","90x65x12",null,1420,534000,511000,11700,11300]
[19,"( V3 ) (B)","125x90x16",null,2490,1948000,1512000,31000,24200]
[20,"( V4 ) (B)","150x110x25",null,4175,5120000,3380000,71500,45000]
[]
[]
["ssz.","ISO-kód","ix","iy","CF","GFM","RM","Anyag"]
[1,"T 45/A",13.8,9.5,5,3.34,370,"ST-37"]
[2,"T 50/A",15.4,10.5,5,3.73,370,"ST-37"]
[3,"T 70-2/A",21.2,14.8,8,8.26,370,"ST-37"]
[4,"T 70-1/A",20.9,14,6,7.47,370,"ST-37"]
[5,"T 75-3/A",19.2,15.5,8,8.6300000000000008,370,"ST-37"]
[6,"T 75-3/B",19.2,15.5,8,8.6300000000000008,440,"ST-44"]
[7,"T 82/A",21.3,16.7,7.5,8.5500000000000007,370,"ST-37"]
[8,"T 89/A",19.5,18.3,10,12.3,370,"ST-37"]
[9,"T 89/B",19.5,18.3,10,12.3,440,"ST-44"]
[10,"T 90/A",24.3,17.5,10,13.55,370,"ST-37"]
[11,"T 90/B",24.3,17.5,10,13.55,440,"ST-44"]
[12,"T 125/B",25.7,26.4,10,17.899999999999999,440,"ST-44"]
[13,"T 127-1/B",28.7,25.6,10,17.77,440,"ST-44"]
[14,"T 127-2/B",26.3,28.3,10,22.48,440,"ST-44"]
[15,"T 140-1/B",33.9,29.7,12.7,27.6,440,"ST-44"]
[16,"( V0 ) (A)",10.4,10.3,6,4.4400000000000004,380,"A38",null,null,null,{"$f":"(G9+G10+F19+G48+#REF!)/AN45+G24","v":{"$error":"#REF!"}}]
[17,"( V1 ) (B)",11.2,11.1,7,5.96,380,"A38",null,null,null,{"$f":"((F21+G41)/AN45)","v":{"$error":"#DIV/0!"}}]
[18,"( V2 ) (B)",18.899999999999999,18.8,9,11.2,380,"A38",null,null,null,{"$f":"SUM(L1503:L1504)","v":{"$error":"#REF!"}}]
[19,"( V3 ) (B)",24.7,24.6,11,19.7,380,"A38",null,null,null,{"$f":"L1505*COS(E95)","v":{"$error":"#REF!"}}]
[20,"( V4 ) (B)",28.3,28.2,16,32.799999999999997,380,"A38",null,null,null,{"$f":"POWER(L1506,2)","v":{"$error":"#REF!"}}]
[]
[]
["FDR számítása"]
[null,"terelés"]
[0,"nincs",null,null,null,null,"FDR = [(GK + GQ + GT + GG + GZS + GH + GU) / KZU+ GD]*g =",{"$f":"((G9+G10+F19+F21+G41+G48+G45)/KZU+G24)*9.81","v":31909.913064}]
[1,"ellensúly terelve (\"fülke-hajtás\")",null,null,null,null,null,{"$f":"(((G9+G10+F19+G48+G45)/KZU+G24)^2+((F21+G41)/KZU)^2-2*((G9+G10+F19+G48+G45)/KZU+G24)*((F21+G41)*KZU)*COS(E95))^0.5*9.81","v":5999.8509359999998}]
[2,"fülke terelve (\"ellensúly-hajtás\")",null,null,null,null,"FDR = {[(GK+GQ+GT+GH+GU)/KZU]^2+[(GG+GZS)/KZU+GD]^2-2*[(GK+GQ+GT+GH+GU)/KZU]*[(GG+GZS)/KZU+GD]*cos(beta)}^0,5*g =",{"$f":"(((G9+G10+F19+G48+G45)/KZU)^2+((F21+G41)*KZU+G24)^2-2*((G9+G10+F19+G48+G45)/KZU)*((F21+G41)/KZU+G24)*COS(E95))^0.5*9.81","v":5018.8509359999989}]
[]
["FRR számítása"]
[null,"terelés",null,null,null,null,null,null,null,{"$f":"(GK+GQr+GU+GH)","v":727.2},{"$f":"(g+AKN)/KZU","v":10.31}]
[0,"nincs",null,null,null,null,"FRR =",0,null,{"$f":"J1517*K1517","v":7497.4320000000007}]
[1,"ellensúly terelve (\"fülke-hajtás\")",null,null,null,null,"FRR = {[(GG+GZS)/KZU+GR]^2+[(GG+GZS)/KZU]^2-2*[(GG+GZS)/KZU+GR]*[(GG+GZS)/KZU]*cos(pi-beta)}^0,5*g =",{"$f":"(((F21+G41)*KZU+G57)^2+((F21+G41)/KZU)^2-2*((F21+G41)/KZU+G57)*((F21+G41)/KZU)*COS(PI()-E95))^0.5*9.81","v":25910.062128000001},null,{"$f":"(GK+GQr+GU+GH)*(9.81+AKN)/KZU","v":7497.4320000000007}]
[2,"fülke terelve (\"ellensúly-hajtás\")",null,null,null,null,"FRR = {[(GK+GQ+GT+GH+GU)/KZU]^2+[(GK+GQ+GT+GH+GU)/KZU+GR]^2-2*[(GK+GQ+GT+GH+GU)/KZU]*[(GK+GQ+GT+GH+GU)/KZU+GR]*cos(pi - beta)}^0,5*g =",{"$f":"(((G9+G10+F19+G48+G45)/KZU)^2+((G9+G10+F19+G48+G45)*KZU+G57)^2-2*((G9+G10+F19+G48+G45)/KZU)*((G9+G10+F19+G48+G45)/KZU+G57)*COS(PI()-E95))^0.5*9.81","v":36928.764000000003}]
[]
[]
[]
[null,null,null,null,null,null,null,null,null,null,null,null,null,null,null,"Berakodás","Berakodás"]
[null,null,null,null,null,null,null,null,null,null,null,null,null,null,null,{"$f":"((GK+1.25*GQ+GU+GH))*g","v":20929.144499999999},{"$f":"GG*g","v":12581.325000000001}]
[null,null,null,null,null,null,null,null,null,null,null,null,null,null,null,{"$f":"_GZf1*IF(HI=1,g+(KZU*AKN),g-(KZU*AKN))","v":0},{"$f":"_GZe2*IF(HI=0,(g-(KZU*AKN)),g+(KZU*AKN))","v":287.03039999999999}]
[]
[]
[]
[]
[]
[]
[null,null,null,null,null,null,null,null,null,null,null,null,null,null,null,{"$f":"SUM(P1525:P1531)","v":20929.144499999999},{"$f":"SUM(Q1525:Q1531)","v":12868.3554}]
[]
[]
[]
[]
[]
[]
[]
[]
[]
[]
[]
[]
[]
[]
[]
[]
[]
[]
[]
[]
[]
[]
[]
[]
["Hengerelt \"U\"-acélok (MSZ 326)"]
["U","b [mm]","A [mm2]","IX [mm4]","IY [mm4]","WX [mm3]","WY [mm3]","iy [mm]","kg/m"]
[50,38,712,264000,91200,10600,3750,11.3,5.59]
[65,42,903,575000,141000,17700,5070,12.5,7.09]
[80,45,1100,1060000,194000,26500,6360,13.3,8.64]
[100,50,1350,2060000,293000,41200,8490,14.7,10.6]
[120,55,1700,3640000,432000,60700,11100,15.9,13.4]
[140,60,2040,6050000,627000,86400,14800,17.5,16]
[160,65,2400,9250000,853000,116000,18300,18.899999999999999,18.8]
[180,70,2800,13500000,1140000,150000,22400,20.2,22]
[200,75,3220,19100000,1480000,191000,27000,21.4,25.3]
[220,80,3740,26900000,1970000,245000,33600,23,29.4]
[240,85,4230,36000000,2480000,300000,39600,24.2,33.200000000000003]
[260,90,4830,48200000,3170000,371000,47700,25.6,37.9]
[280,95,5330,62800000,3990000,448000,57200,27.4,41.8]
[300,100,5880,80300000,4950000,535000,67800,29,46.2]
[]
["Hengerelt \"I\"-acélok (MSZ 532)"]
["I","b [mm]","A [mm2]","IX [mm4]","IY [mm4]","WX [mm3]","WY [mm3]","iy [mm]","kg/m"]
[80,42,757,778000,62900,19500,3000,9.1,5.94]
[100,50,1060,1710000,122000,34200,4880,10.7,8.34]
[120,58,1420,3280000,215000,54700,7410,12.3,11.1]
[140,66,1820,5730000,352000,81900,10700,14,14.3]
[160,74,2280,9350000,547000,117000,14800,15.5,17.899999999999999]
[180,82,2790,14500000,813000,161000,19800,17.100000000000001,21.9]
[200,90,3340,21400000,1170000,214000,26000,18.7,26.2]
[220,98,3950,30600000,1620000,278000,33100,20.2,31.1]
[240,106,4610,42500000,2210000,354000,41700,22,36.200000000000003]
[260,113,5330,57400000,2880000,442000,51000,23.2,41.9]
[280,119,6100,75900000,3640000,542000,61200,24.5,47.9]
[300,125,6900,98000000,4510000,653000,72200,25.6,54.2]
[320,131,7770,125100000,5550000,782000,84700,26.7,61]
[340,137,8670,157000000,6740000,923000,98400,28,68]
[360,143,9700,196100000,8180000,1090000,114000,29,76.099999999999994]
[380,149,10700,240100000,9750000,1260000,131000,30.2,84]
[400,155,11800,292100000,11600000,1460000,149000,31.3,92.4]
[]
[]
["1.1. táblázat",null,null,null,null,"1.1.A táblázat"]
["Névl. teherbírás",null,"Fülke max. alapterülete",null,null,"Névl. teherbírás","Fülke max. alapterülete"]
[null,null,null,null,"AA / A"]
[100,1,0.37,1,null,100,0.37]
[180,2,0.57999999999999996,2,null,180,0.57999999999999996]
[225,3,0.7,3,null,225,0.7]
[300,4,0.9,4,null,300,0.9]
[375,5,1.1000000000000001,5,null,375,1.1000000000000001]
[400,6,1.17,6,{"$f":"G1604/C1604","v":1.4358974358974359},400,1.68]
[450,7,1.3,7,1.4153846153846155,450,1.84]
[525,8,1.45,8,1.4344827586206899,525,2.08]
[600,9,1.6,9,1.4499999999999997,600,2.3199999999999998]
[630,10,1.66,10,1.4578313253012047,630,2.42]
[675,11,1.75,11,1.4628571428571429,675,2.56]
[750,12,1.9,12,1.4736842105263157,750,2.8]
[800,13,2,13,1.48,800,2.96]
[825,14,2.0499999999999998,14,1.4829268292682929,825,3.04]
[900,15,2.2000000000000002,15,1.4909090909090907,900,3.28]
[975,16,2.35,16,1.4978723404255319,925,3.52]
[1000,17,2.4,17,1.5,1000,3.6]
[1050,18,2.5,18,1.488,1050,3.72]
[1125,19,2.65,19,1.4716981132075473,1125,3.9]
[1200,20,2.8,20,1.4571428571428573,1200,4.08]
[1250,21,2.9,21,1.4482758620689655,1250,4.2]
[1275,22,2.95,22,1.4440677966101694,1275,4.26]
[1350,23,3.1,23,1.4322580645161291,1350,4.4400000000000004]
[1425,24,3.25,24,1.4215384615384616,1425,4.62]
[1500,25,3.4,25,1.411764705882353,1500,4.8,null,{"$f":"VLOOKUP(G9,A1599:G1626,2)","v":19}]
[1600,26,3.56,26,1.4157303370786516,1600,5.04,null,{"$f":"VLOOKUP(G9,C1599:D1626,2)","v":28}]
[2000,27,4.2,27,null,2000]
[2500,28,5,28,null,2500]
[null,29,5.0999999999999996,29,null,2501]
[]
["GQ1 =",{"$f":"VLOOKUP(G9,A1599:G1626,1)","v":1125},"A1 =",{"$f":"VLOOKUP(G9,A1599:G1626,3)","v":2.65}]
["GQ2 =",{"$f":"VLOOKUP(I1623+1,B1599:G1627,5)","v":1200},"A2 =",{"$f":"VLOOKUP(I1623+1,B1599:G1627,2)","v":2.8}]
[]
["GQ1 =",{"$f":"VLOOKUP(G9,A1599:G1626,1)","v":1125},"A1 =",{"$f":"VLOOKUP(G9,A1599:G1626,7)","v":3.9}]
["GQ2 =",{"$f":"VLOOKUP(I1623+1,B1599:G1627,5)","v":1200},"A2 =",{"$f":"VLOOKUP(I1623+1,B1599:G1626,6)","v":4.08}]
[]
["Interpoláció az 1.1 táblázat szerint:"]
[null,null,null,null,null,"Amax = A1 + (GQ - GQ1) * (A2 - A1) / (GQ2 - GQ1) =",{"$f":"D1629+(G9-B1629)*(D1630-D1629)/(B1630-B1629)","v":2.65},"m2"]
["Interpoláció az 1.1.A táblázat szerint:"]
[null,null,null,null,null,"Amax = A1 + (GQ - GQ1) * (A2 - A1) / (GQ2 - GQ1) =",{"$f":"D1632+(G9-B1632)*(D1633-D1632)/(B1633-B1632)","v":3.9},"m2"]
["Ha GQ > 2500 kg-nál, számítással:"]
[null,null,null,null,null,"A = 5 + (GQ - 2500) * 0,16 /100 =",{"$f":"5+(G9-2500)*0.16/100","v":2.8},"m2"]
[]
[]
[]
["Emlékeztető: Kéttámaszú tartó lehajlása:"]
[]
[]
[]
[]
[]
[]
[]
[]
[]
[]
[]
[]
[]
[]
[]
[]
[]
[]
[]
["A kéttámaszú tartó lehajlása egy erő hatására"]
["(a meggörbült tartó rugalmas szálának egyenlete),"]
["az (x = < a) szakaszon, ezen belül tetszőleges helyen:"]
[null,null,"y (x)  = F  b (L2x - b2x - x3) / 6* I  E L"]
["A legnagyobb lehajlás helye (ahol e függvény differenciálhányadosának értéke 0):"]
[]
[null,null,"xm =       (L2-b2)/3    ",null,"ha b < = L/2"]
["Ennek szélső értéke, azaz, ha az erő helye a tartó vége felé közelít, azaz szélső "]
["esetben: xm = 0,577 * L . Ebből az következik, hogy a legnagyobb lehajlás helye"]
["az erő bármelyik helyzetében a tartó közepén, a tartó hosszának 42 és 58 %-a "]
["között van."]
[]
["max. lassulás"]
[0,"nem rövidített ütköző",null,0.5,"A lassulás legalább 0,5 m/s!"]
[1,"rövidített üzközőlöket",null,0.8,"A lassulás legalább 0,8 m/s!"]

{"sheet":"Munka1","index":3,"n_rows":0,"n_cols":0,"rows_kept":0,"cut":false,"hidden":false,"merged":[]}

{"sheet":"Munka2","index":4,"n_rows":0,"n_cols":0,"rows_kept":0,"cut":false,"hidden":false,"merged":[]}

{"sheet":"Munka3","index":5,"n_rows":0,"n_cols":0,"rows_kept":0,"cut":false,"hidden":false,"merged":[]}

{"sheet":"Fund.","index":6,"n_rows":1670,"n_cols":10,"rows_kept":1670,"cut":false,"hidden":false,"merged":[[1428,5,1429,5],[1443,5,1443,6],[1588,0,1589,0],[1588,2,1589,2],[1588,5,1589,5],[1588,6,1589,6],[297,0,297,1],[297,2,297,4],[297,5,297,7],[1428,6,1428,8],[298,0,299,1],[300,0,301,1],[348,5,349,8],[350,5,351,8],[361,4,363,8],[601,0,601,1],[601,2,601,4],[601,5,601,7],[602,0,603,1],[604,0,605,1],[1428,0,1429,3],[1428,4,1429,4],[136,4,136,5],[138,4,138,5],[139,4,139,5],[180,3,181,8],[225,1,227,6],[97,0,98,6],[100,0,101,6],[110,1,110,8],[134,4,134,5],[135,4,135,5]]}
[]
[]
[]
[]
[]
[]
["Beépítési hely:",null,null,"Xxxx"]
["Terhelési- és egyéb adatok:"]
["Teherbírás:",null,null,null,null,"GQ =",1025,"kg"]
["Ha a rakodógép behajt a fülkébe, annak tömege:",null,null,null,null,"GT =",0,"kg"]
["Névleges sebesség:",null,null,null,null,"VKN =",1,"m/s"]
["Függesztési tényező:",null,null,null,null,"KZU =",2,"-"]
["Az óránkénti indítások száma:",null,null,null,null,"ZKH =",180,"1/h"]
["Emelési magasság (max. 42,0 m): ",null,null,null,null,"HQ =",15,"m"]
["Süllyeszték mélysége:",null,null,null,null,"HSG =",1.2,"m"]
["Fejmagasság:",null,null,null,null,"HSK =",3.7,"m"]
["Aknamagasság:",null,null,null,null,"HS =",{"$f":"+G14+G15+G16","v":19.899999999999999},"m"]
["Fülke tömege:",null,null,null,null,"GK =",1100,"kg"]
["Kiegyenlítési tényező:",null,null,null,null,"KG =",0.5,"-"]
["Ellensúly tömege:",null,null,null,null,"GG = KG*GQ + GK  =",{"$f":"G19*G9+G18","v":1612.5},"kg"]
["Hajtómű tömege:",null,null,null,null,"GW =",250,"kg"]
["Géptartó gerenda tömege:",null,null,null,null,"GWR=",60,"kg"]
["Hajtótárcsa tömege:",null,null,null,null,"GD =",58,"kg"]
["A függesztőkötél névleges átmérője:",null,null,null,null,"DZ = ",11,"mm"]
["Kötélszerkezet:",null," SEALE + 8,0 B 1570 RF 8 x 19  nyolcpászmás acélsodronykötél."]
["A függesztőkötél darabszáma:",null,null,null,null,"ZZ = ",4,"db"]
["Egy kötél tömege méterenként:",null,null,null,null,"GZM1 =",0.22,"kg/m"]
["A kötél anyagának szakítószilárdsága:",null,null,null,null,"sB  =",1570,"N/mm2"]
["Egy kötél min. szakítóereje:",null,null,null,null,"FZM =",57400,"N "]
["Függesztő kötél kiegyenlítetlen hosszának tömege:"]
[null,null,null,null,null,"GZ = GZM1 * ZZ * HQ =",{"$f":"G14*G26*G27","v":13.2},"kg"]
["Függesztő kötél teljes hosszának tömege:"]
[null,null,null,null,null,"GZS ~= GZM1 * ZZ * (HS + HSK) * KZU =",{"$f":"(G17+G16)*G26*G27*G12","v":41.535999999999994},"kg"]
["A kiegyenlítőlánc javasolt folyóméter-tömege:",null,null,null,null,"GUMJ = ",{"$f":"G26*G27*G12","v":1.76},"kg"]
["Kiegyenlítő lánc tömege méterenként:",null,null,null,null,"GUM =",0,"kg/m"]
["Kiegyenlítő lánc tömege:",null,null,null,null,"GU = GUM * HQ =",{"$f":"G35*G14","v":0},"kg"]
["Függőkábel folyóméterenkénti tömege:",null,null,null,null,"GHM =",1.25,"kg/m"]
["Függőkábel tömege:",null,null,null,null,"GH = GHM * HQ/2 =",{"$f":"+G14*G37/2","v":9.375},"kg"]
["A hajtótárcsa névleges (közép) átmérője:",null,null,null,null,"DD =",570,"mm"]
["A hajtótárcsa horonykivitele: ",null,null,null,null,null,3,null,{"$f":"IF( OR(G40<1,G40>3),\"Helytelen adat!\",\" \")","v":" "}]
[1,"   Alámetszett félkör alakú, ill. tele félkör alakú horony"]
[2,"   Edzés nélküli, alámetszett ékhorony ",null,null,null,null,null,null,{"$f":"IF( AND(G40=1,G44<25),\"gammaZ legalább 25 fokos legyen!\",\" \")","v":" "}]
[3,"   Edzett, alámetszés nélküli ékhorony",null,null,null,null,null,null,{"$f":"IF( AND(G40=2,G45=0),\"Alámetszett ékhorony, javítsd!\",\" \")","v":" "}]
["A horony ékszöge:",null,null,{"$f":"PI()*G44/180","v":0.6108652381980153},"rad =","gZ =  ",35,"o",{"$f":"IF( AND(G40>1,G44<35),\"Legalább 35 fokos legyen!\",\" \")","v":" "}]
["Az alámetszés szélessége:",null,null,null,null,"BZU =",8,"mm",{"$f":"IF(G45>0.8*G24,\"BZU>0,8*DZ\",\" \")","v":" "},{"$f":"IF( AND(G40=3,G45>0),\"Alámetszés nélküli ékhorony, írj 0-t!\",\" \")","v":"Alámetszés nélküli ékhorony, írj 0-t!"}]
["A terelés módja (0; 1; 2):",null,null,{"$f":"VLOOKUP(G46,A1504:H1506,2)","v":"ellensúly terelve (\"fülke-hajtás\")"},null,null,1,null,{"$f":"IF(AND(E60<PI(),G46=0)=TRUE,\"nincs szinkronban TZ-vel!\",\" \")","v":" "}]
["A terelőtárcsa névleges átmérője:",null,null,null,null,"DR1 =",440,"mm"]
["A kötéltárcsák (függesztőtárcsák) névleges átmérője:",null,null,null,null,"DR2 =",440,"mm"]
["Egy kötéltárcsa tömege:",null,null,null,null,"GR =",44,"kg"]
["Egy kötéltárcsa tehetetlenségi nyomatéka:",null,null,null,null,"IR =",{"$f":"0.225*G49*(G48/1000)^2","v":1.9166400000000001},"kgm2 "]
["A terelőtárcsák száma a fülkei oldalon:",null,null,null,null,"NK =",2,"db"]
["A terelőtárcsák száma az ellensúly oldalán:",null,null,null,null,"NG =",1,"db"]
["A terelőtárcsák száma azonos értelmű hajlítással:",null,null,null,null,"Nps = ",2]
["A terelőtárcsák száma ellentétes értelmű hajlítással:",null,null,null,null,"Npr = ",0]
["A kötélleeresztés távolsága:",null,null,null,null,"TZ = ",790,"mm",{"$f":"IF(G55<G39,\"TZ < DD, nem megengedett!\",\" \")","v":" "}]
["A hajtótárcsa és a terelőtárcsa tengelyeinek függőleges távolsága",null,null,null,null,null,null,null,{"$f":"IF(G173>0,\" \",\"TZ, DD, DR és HDA nincsenek összhangban!\")","v":" "}]
["(ha nincs ter.: a ht. és a kötélbek. függ. távolsága)",null,null,null,null,"HDA = ",850,"mm"]
["Hurok-hajtás-e? (0, v. 1)",null,null,null,{"$f":"IF(G58>0,\"igen, hurok-hajtás\",\"nem, nem hurokhajtás\")","v":"nem, nem hurokhajtás"},null,0]
["A hajtótárcsa átfogási szöge (számítása később):"]
[null,null,null,"b = ",{"$f":"F177","v":2.8906457136734254},"rad =",{"$f":"H177","v":165.62179946106909},"o",{"$f":"IF(AND(E60=PI(),G46>0)=TRUE,\"nincs szinkronban G37 cellával!\",\" \")","v":" "}]
["Az ütköző lökete rövidített? (\"0\" = nem, \"1\" = igen)",null,null,null,null,null,1]
["A fülke gyorsulása (lassulása) vészleállításkor:",null,null,null,null,"AKN =",0.3,"m/s2",{"$f":"IF(G62<VLOOKUP(G61,A1669:D1670,4),VLOOKUP(G61,A1669:E1670,5),\" \")","v":"A lassulás legalább 0,8 m/s!"}]
["A fülke szélessége (belméret):",null,null,null,null,"BK =",1300,"mm"]
["A fülke mélysége (hosszúsága, belméret):",null,null,null,null,"TK =",2000,"mm"]
["A fülke alapterülete:",null,null,null,null,"AKV = BK*TK =",{"$f":"G63*G64/1000000","v":2.6},"m2 ",{"$f":"IF(G65>G67,\"A fülke alapterülete nagyobb a megengedettnél!\",\" \")","v":"A fülke alapterülete nagyobb a megengedettnél!"}]
["A fülke max. megengedett alapterülete:"]
[null,null,null,null,null,{"$f":"IF(G9>2500,\"AKV max = 5 + (GQ - 2500) * 0,16 /100 =\",\"Az 1.1 táblázatból interpolálással: AKV max =\")","v":"Az 1.1 táblázatból interpolálással: AKV max ="},{"$f":"IF(G9>2500,G1632,G1628)","v":2.4500000000000002},"m2 "]
[]
["A kötélvezetés ábrája:"]
[]
[]
[]
[]
[]
[]
[]
[]
[]
[]
[]
[]
[]
[]
[]
[]
[]
[]
[]
[]
[]
[]
[]
[]
[]
[]
[]
["A hajtótárcsa-tengelyt terhelő erő:"]
[{"$f":"VLOOKUP(G46,A1504:H1506,7)","v":"FDR = {[(GK+GQ+GT+GH+GU)/KZU+GD]^2+[(GG+GZS)/KZU]^2-2*[(GK+GQ+GT+GH+GU)/KZU+GD]*[(GG+GZS)/KZU]*cos(beta)}^0,5*g ="}]
[null,null,null,null,null,null,null,{"$f":"VLOOKUP(G46,A1504:H1506,8)","v":19004.105547223207},"N"]
["A terelőtárcsa-tengelyt terhelő erő:"]
[{"$f":"VLOOKUP(G46,A1510:H1512,7)","v":"FRR = {[(GG+GZS)/KZU+GR]^2+[(GG+GZS)/KZU]^2-2*[(GG+GZS)/KZU+GR]*[(GG+GZS)/KZU]*cos(pi-beta)}^0,5*g ="}]
[null,null,null,null,null,null,null,{"$f":"VLOOKUP(G46,A1510:H1512,8)","v":2128.1566664442289},"N"]
[]
["Függesztő kötél:"]
["Az előírt biztonsági tényező meghatározása:"]
[{"$f":"VLOOKUP(G40,A41:B43,2)","v":"   Edzett, alámetszés nélküli ékhorony"}]
["Az alámetszési szög:"]
[null,null,null,null,"aZ = 2*arcsin (BZU / DZ) =",{"$f":"2*ASIN(G45/G24)","v":1.6286798842530505},"rad     =",{"$f":"F108/PI()*180","v":93.316483545555215},"°"]
[]
["Táblázat a hajtótárcsák egyenértékű darabszámához:"]
[null,"Ékhornyok ékszögei (gZ) fokban"]
[1,35,36,37,38,39,40,42,45]
["Nequiv (t) ",18.5,15.2,12.85,10.5,8.8000000000000007,7.1,5.6,4]
[null,"Alámetszett, félkör- vagy ékalakú hornyok (aZ) alámetszési szögei fokban:"]
[2,0,75,80,85,90,95,100,105]
["Nequiv (t) ",1,2.5,3,3.8,5,6.7,10,15.2]
[]
[]
["A hajtótárcsák egyenértékű darabszáma:"]
["Ékhoronynál a táblázatból:",null,null,null,"Nequiv (t) = ",{"$f":"IF(G40=3,HLOOKUP(G44,B112:I113,2),\"Nem alámetszés nélküli ékhorony!\")","v":18.5}]
["N equiv (t) meghatározása interpolációval alámetszett horonynál:"]
[" aZ 1 =",{"$f":"HLOOKUP(H108,B115:I116,1)","v":90},null,null,"Nequiv (t)1 = ",{"$f":"HLOOKUP(H108,B115:I116,2)","v":5}]
["aZ 2 =",{"$f":"HLOOKUP(H108+5,B115:I116,1)","v":95},null,null,"Nequiv (t)2 = ",{"$f":"HLOOKUP(H108+5,B115:I116,2)","v":6.7}]
[null,null,null,null,null,"Nequiv(t) = Nequiv(t)1 +  (aZ - aZ1)* (Nequiv(t)2 - Nequiv(t)1) / (aZ2 - aZ1) =",{"$f":"IF(G40<3,F122+(H108-B122)*(F123-F122)/IF(B123-B122=0,1,(B123-B122)),\"alámetszés nélküli ékhorony!\")","v":"alámetszés nélküli ékhorony!"}]
[]
["A hajtótárcsa és a terelőtárcsa átmérőviszonya:"]
[null,null,null,null,null,"Kp = (DD / DR1)4 = ",{"$f":"IF(G47=0,0,(G39/G47)^4)","v":2.8163635616590392}]
["A hajtótárcsa és a kötéltárcsák (függesztőtárcsák) átmérőviszonya:"]
[null,null,null,null,null,"Kp = (DD / DR2)4 = ",{"$f":"IF(G48=0,0,(G39/G48)^4)","v":2.8163635616590392}]
["A terelőtárcsák egyenértékű száma:"]
[null,null,null,null,null,"Nequiv (p) = (Nps + 4 * Npr) * Kp = ",{"$f":"IF(G129<G127,(G53+4*G54)*G127,(G53+4*G54)*G129)","v":5.6327271233180785}]
["Az egyenértékű eredő kötéltárcsaszám:"]
[null,null,null,null,null,"Nequiv  = Nequiv(t) +  Nequiv(p) = ",{"$f":"IF(G40<3,G124+G131,F120+G131)","v":24.132727123318077}]
["Az előírt min. biztonsági tényező:"]
[null,null,null,null,"695,85*106 * Nequiv"]
["Számított:",null,null,"log","DD  8,567 "]
[null,null,null,null,"DZ        "]
[null,null,"2,6834 -"]
[null,null,null,"log","77,09 *    DD  -2,894 "]
[null,null,null,null,"         DZ"]
[null,"IZZ = 10",null,null,null,null,"=",{"$f":"10^(2.6834-LOG10(695.85*10^6*G133/(G39/G24)^8.567)/LOG10(77.09*(G39/G24)^-2.894))","v":17.058169701947676}]
[]
["Előírt ","(min.:",{"$f":"IF(G26>2,12,16)","v":12},"):",null,null,"IZZ = ",{"$f":"IF(H141<C143,C143,H141)","v":17.058169701947676}]
[]
["A kötél tényleges biztonsági tényezője :"]
[null,null,null,null,null,"IZ = ZZ * FZM * KZU / [(GK + GQ + GT + GZ*KZU) * g] =",{"$f":"G26*G29*G12/((G9+G18+G10+G31*G12)*9.81)","v":21.757636044215381}]
[null,null,null,null,null,null,{"$f":"IF(G146>H143,\">= IZZ, megfelel\",\"< IZZ, nem felel meg.\")","v":">= IZZ, megfelel"}]
["Átmérőviszony:",null,null,null,null,"DD / DZ =",{"$f":"G39/G24","v":51.81818181818182}]
[null,null,null,null,null,null,{"$f":"IF(G148>=40,\">= 40, megfelel\",\"< 40, nem felel meg\")","v":">= 40, megfelel"}]
[null,null,null,null,null,"DR1 / DZ =",{"$f":"IF(G47=0,\"nem értelmezhető\",G47/G24)","v":40}]
[null,null,null,null,null,null,{"$f":"IF(G150>=40,\" megfelel\",\"< 40, nem felel meg\")","v":" megfelel"}]
[null,null,null,null,null,"DR2 / DZ =",{"$f":"IF(G48=0,\"nem értelmezhető\",G48/G24)","v":40}]
[null,null,null,null,null,null,{"$f":"IF(G152>=40,\"megfelel\",\"< 40, nem felel meg\")","v":"megfelel"}]
["Az átfogási szög meghatározása:"]
[]
[]
[]
[]
[]
[]
[]
[]
[]
[]
[]
[]
[]
[]
[]
[]
[]
[]
[null,null,null,null,null,"TDA = TZ - (DD + DR1) / 2 =",{"$f":"IF(G57=0,G39-(G39+G47)/2,G55-(G39+G47)/2)","v":285},"mm"]
[null,null,null,null,"d = arc tg (HDA / TDA) =",{"$f":"IF(G173=0,PI()/2,ATAN(G57/G173))","v":1.2472821057965615},"rad = ",{"$f":"180*F174/PI()","v":71.464000524332803},"o "]
[null,null,null,null,"e = arc sin [(DD-DR1) / (2 * (TDA2 + HDA2)0,5)] =",{"$f":"ASIN(((G39-G47)/(2*(G57^2+G173^2)^0.5)))","v":7.25672810819675E-2},"rad = ",{"$f":"180*F175/PI()","v":4.1577989367362802},"o "]
["Átfogási szög a hajtótárcsán:",null,null,{"$f":"IF(G58>0,\"(hurok-hajtás)\",\" \")","v":" "}]
[null,null,null,null,{"$f":"IF(G58>0,\"b = 1,5 * p + d + 3 * e =\",\"b = p / 2 + d + e =\")","v":"b = p / 2 + d + e ="},{"$f":"IF(G58>0,1.5*PI()+F174+3*F175,PI()/2+F174+F175)","v":2.8906457136734254},"rad = ",{"$f":"180*F177/PI()","v":165.62179946106909},"o "]
[]
["A hajtótárcsa és a kötél kapcsolatának ellenőrzése"]
[{"$f":"VLOOKUP(G40,A41:B43,2)","v":"   Edzett, alámetszés nélküli ékhorony"}]
["A fülkébe való berakodás:",null,null,"(A 125 % terhelésű, illetve az esetlegesen behajtó rakodógéppel terhelt fülke statikusan nem csúszhat meg)"]
[]
["Az statikus súrlódási tényező:",null,null,null,null,"mZL =",0.1]
["A látszólagos súrlódási tényező:"]
["Félkör alakú alámetszett horony esetén:"]
[1,null,null,null,null,null,"mZRL = 4*mZL*(cosgZ/2 - sinaZ/2) / (p-aZ-gZ-sinaZ+singZ) =",{"$f":"IF(G40=1,4*G183*(COS(D44/2)-SIN(F108/2))/(PI()-F108-D44-SIN(F108)+SIN(D44)),\"Nem félkör-horony!\")","v":"Nem félkör-horony!"}]
["Edzés nélküli, alámetszett ékhorony esetén:"]
[2,null,null,null,null,null,"mZRL = 4*mZL*(1 - sin aZ/2) / (p - aZ - sinaZ ) =",{"$f":"IF(G40=2,4*G183*(1-SIN(F108/2))/(PI()-F108-SIN(F108)),\"Nem alám. ékhorony!\")","v":"Nem alám. ékhorony!"}]
["Edzett ékhorony esetén:"]
[3,null,null,null,null,null,"mZRL = mZL /  (sin gZ/2) =",{"$f":"IF(G40=3,G183/(SIN(D44/2)),\"Nem edzett ékhorony!\")","v":0.3325509523423042}]
["Az áthúzási viszonyszám:"]
[null,null,null,null,null,null,"e mZRL * bD =",{"$f":"EXP(VLOOKUP(G40,A186:H190,8)*E60)","v":2.6150598513651295}]
["A statikus erők viszonya:"]
[null,null,null,null,null,null,{"$f":"+IF(G10>0.25*G9,\"IZD1 = FZ11 / FZ21 = (GQ + GT + GK + GZ*KZU) / GG =\",\"IZD1 = FZ11 / FZ21 = (1,25*GQ + GK + GZ*KZU) / GG = \")","v":"IZD1 = FZ11 / FZ21 = (1,25*GQ + GK + GZ*KZU) / GG = "},{"$f":"IF(G10>0.25*G9,(G9+G10+G18+G31*G12)/G20,(1.25*G9+G18+G31*G12)/G20)","v":1.4931162790697674}]
[]
[null,null,null,null,{"$f":"IF(H194>H192,\"FZ11 / FZ21 > \",\"FZ11 / FZ21 <=\")","v":"FZ11 / FZ21 <="},"e mZRL * bD",null,{"$f":"IF(H194>H192,\"nem felel meg\",\"megfelel\")","v":"megfelel"}]
[]
["Vészleállítás:",null,"(A névleges terhelésű, ill. a terheletlen fülke dinamikus viselkedése)"]
["A kötél sebessége:",null,null,null,null,"VZ = VKN * KZU =",{"$f":"G11*G12","v":2},"m/s"]
["A fülke lassulása:",null,null,null,null,"AKN =",{"$f":"G62","v":0.3},"m/s2 "]
["A mozgási súrlódási tényező:",null,null,null,null,"mZN = 0,1 / (1 + VZ/10) =",{"$f":"0.1/(1+G199/10)","v":8.3333333333333343E-2}]
["A látszólagos súrlódási tényező:"]
["Félkör alakú alámetszett horony esetén:"]
[1,null,null,null,null,null,"mZRN = 4*mZN*(cosgZ/2-sinaZ/2) / (p-aZ-gZ-sinaZ+singZ) =",{"$f":"IF(G40=1,4*G201*(COS(D44/2)-SIN(F108/2))/(PI()-F108-D44-SIN(F108)+SIN(D44)),\"Nem félkör-horony!\")","v":"Nem félkör-horony!"}]
["Edzés nélküli, alámetszett ékhorony esetén:"]
[2,null,null,null,null,null,"mZRL = 4*mZL*(1 - sin aZ/2) / (p - aZ - sinaZ ) =",{"$f":"IF(G40=2,4*G201*(1-SIN(F108/2))/(PI()-F108-SIN(F108)),\"Nem alám. ékhorony!\")","v":"Nem alám. ékhorony!"}]
["Edzett ékhorony esetén:"]
[3,null,null,null,null,null,"mZRN = mZN /  (sin g/2) =",{"$f":"IF(G40=3,G201/(SIN(D44/2)),\"Nem edzett ékhorony!\")","v":0.27712579361858686}]
[]
["Az áthúzási viszonyszám:",null,null,null,null,null,"e mZRN * bD =",{"$f":"EXP(VLOOKUP(G40,A204:H208,8)*E60)","v":2.2279290736554831}]
["A dinamikus erők viszonya terhelt fülke mellett:"]
["(A fülke az alsó véghelyzetben lefelé haladva lassul)"]
[null,null,null,null,null,null,"FZ12 = (GQ+GK)*(g+AKN)/KZU+GZ*(g+KZU*AKN)+4*IR*NK*AKN/DR2 =",{"$f":"IF(G47=0,(G9+G18)*(9.81+G62)/G12+G31*(9.81+G12*G62),(G9+G18)*(9.81+G62)/G12+G31*(9.81+G12*G62)+4*G50*G51*G62/G47^2)","v":10879.287023760002},"N"]
[null,null,null,null,null,null,"FZ22 = (GG+GU)*(g - AKN)/KZU - 4*IR*NG*AKN/DR2 =",{"$f":"IF(G47=0,(G20+G36)*(9.81-G62)/G12,(G20+G36)*(9.81-G62)/G12-4*G50*G52*G62/G47^2)","v":7667.4374881200001},"N"]
[null,null,null,null,null,null,"IZD2 = FZ12 / FZ22 = ",{"$f":"H213/H214","v":1.4188947794639959}]
[null,null,null,null,{"$f":"IF(H210<H215,\"IZD2 >\",\"IZD2 <=\")","v":"IZD2 <="},"e mZRN * bD",null,{"$f":"IF(H210<H215,\"nem felel meg\",\"megfelel\")","v":"megfelel"}]
[]
["A dinamikus erők viszonya üres fülke mellett:"]
["(A fülke a felső véghelyzetben felfelé haladva lassul)"]
[null,null,null,null,null,null,"FZ12 = (GK+GH+GU)*(g - AKN)/KZU - 4*IR*NK*AKN/DR2 =",{"$f":"IF(G47=0,(G18+G38+G36)*(9.81-G62)/G12,(G18+G38+G36)*(9.81-G62)/G12-4*G50*G51*G62/G47^2)","v":5275.0781012400003},"N"]
[null,null,null,null,null,null,"FZ22 = GG*(g+AKN)/KZU+GZ*(g+KZU*AKN)+4*IR*NG*AKN/DR2 =",{"$f":"IF(G47=0,G20*(9.81+G62)/G12+G31*(9.81+G12*G62),G20*(9.81+G62)/G12+G31*(9.81+G12*G62)+4*G50*G52*G62/G47^2)","v":8288.5995118800001},"N"]
[null,null,null,null,null,null,"IZD3 = FZ22 / FZ12 = ",{"$f":"H221/H220","v":1.5712752214856531}]
[null,null,null,null,{"$f":"IF(H210<H222,\"IZD3 >\",\"IZD3 <=\")","v":"IZD3 <="},"e mZRN * bD",null,{"$f":"IF(H210<H222,\"nem felel meg\",\"megfelel\")","v":"megfelel"}]
[]
["Elakadt fülke:"]
[null,"(A névleges terhelésű, ill. a terheletlen fülke statikus viselkedése, miközben a fülke ill. az ellensúly az ütközőn ül. A hajtásnak meg kell csúsznia.)"]
[]
[]
[]
["A nyugvó surlódási tényező:",null,null,null,null,"mZP = ",0.2]
["A látszólagos súrlódási tényező:"]
["Félkör alakú alámetszett horony esetén:"]
[null,null,null,null,null,null,"mZRP = 4*mZP*(cosgZ/2 - sinaZ/2)/(p - aZ - gZ - sinaZ+singZ) =",{"$f":"IF(G40=1,4*G230*(COS(D44/2)-SIN(F108/2))/(PI()-F108-D44-SIN(F108)+SIN(D44)),\"Nem félkör-horony!\")","v":"Nem félkör-horony!"}]
["Edzett és edzés nélküli ékhorony esetén:"]
[null,null,null,null,null,null,"mZRP = mZP /  (sin gZ/2) =",{"$f":"IF(G40>1,G230/(SIN(D44/2)),\"Nem ékhorony!\")","v":0.66510190468460839}]
[]
["Az áthúzási viszonyszám:",null,null,null,null,null,"e mZRP * bD =",{"$f":"IF(G40=1,EXP(H233*E60),EXP(H235*E60))","v":6.8385380262218138}]
["A statikus erők viszonya terhelt fülke mellett:"]
["(Az ellensúly ütközőre ült)"]
[null,null,null,null,null,null,"IZD4 = FZ13 / FZ23 = (GQ + GK + GH + GU) / GZ*KZU =",{"$f":"(G9+G18+G38+G36)/(G31*G12)","v":80.84753787878789}]
[null,null,null,{"$f":"IF(H237<H240,\"IZD4 >\",\"IZD4 <=\")","v":"IZD4 >"},"e mZRP * bD",null,{"$f":"IF(H237<H240,\"megcsúszik, megfelel\",\"nem felel meg\")","v":"megcsúszik, megfelel"}]
["A statikus erők viszonya üres fülke mellett:"]
["(A fülke ütközőre ült)"]
[null,null,null,null,null,null,"IZD5 = FZ24 / FZ14 =  (GG + GU) / GZ*KZU =",{"$f":"(G20+G36)/(G31*G12)","v":61.07954545454546}]
[]
[null,null,null,{"$f":"IF(H237<H244,\"IZD5 >\",\"IZD5 <=\")","v":"IZD5 >"},"e mZRP * bD",null,{"$f":"IF(H237<H244,\"megcsúszik, megfelel\",\"nem felel meg\")","v":"megcsúszik, megfelel"}]
[]
["Ellenőrzés horonynyomásra:"]
[]
["Kötélsebesség:",null,null,null,null,"VZ = VKN * KZU =",{"$f":"G11*G12","v":2},"m/s"]
["Az óránkénti indítások számától függő tényező:"]
[null,null,null,null,null,"K = (52 - ZKH2 / 3600 - ZKH / 60) / 50 =",{"$f":"(52-G13^2/3600-G13/60)/50","v":0.8}]
["A számított megengedett horonynyomás:"]
[null,null,null,null,null,"PZZ = K *(12,5+4*VZ)/(1+VZ) =",{"$f":"G252*(12.5+4*G250)/(1+G250)","v":5.4666666666666677},"N/mm2"]
["A megengedett horonynyomás (max. 8,75 N/mm2 ):"]
[null,null,null,null,null,"PZZ =",{"$f":"IF(G254>8.75,8.75,G254)","v":5.4666666666666677},"N/mm2"]
["Egy kötélre eső legnagyobb terhelés:"]
[null,null,null,null,null,"FZM1 = (GQ + GK + GZS) * g / ZZ * KZU =",{"$f":"(G9+G18+G31)*9.81/(G26*G12)","v":2621.9677499999998},"N"]
["A horonyalak-tényező:"]
["Félkör alakú, alámetszett horony esetén:"]
[null,null,null,null,null,"  KDR = 8 * cos (aZ/2) / (p - aZ - sin aZ) =",{"$f":"IF(G40=1,8*COS(F108/2)/(PI()-F108-SIN(F108)), \"Nem félkör-horony!\")","v":"Nem félkör-horony!"}]
["Edzett és edzés nélküli ékhorony esetén:"]
[null,null,null,null,null,"KDR = 4,5 / sin (gZ / 2) = ",{"$f":"IF(G40>1,4.5/SIN(D44/2),\"Nem ékhorony!\")","v":14.964792855403687}]
["A fellépő horonynyomás:"]
[null,null,null,null,null,"PZ = KDR * FZM1 / (DZ * DD) =",{"$f":"IF(G40>1,G263*G258/(G24*G39),G261*G258/(G24*G39))","v":6.257927312966328},"N/mm2"]
[]
[null,null,null,null,{"$f":"IF(G265<G256,\"PZ<\",\"PZ > \")","v":"PZ > "},"PZZ",{"$f":"IF(G265>G256,\"nem felel meg\",\" megfelel\")","v":"nem felel meg"}]
[]
[]
[]
["Vezetősín:"]
[]
["A fülkei vezetősín"]
["Adatok:"]
["A sín sorszáma (1 - 20):",null,null,null,null,null,12]
["A sín ISO-kódja (T…/A = húzott, T…/B = forgácsolt):",null,null,null,null,null,{"$f":"VLOOKUP(G275,A1457:I1476,2)","v":"T 125/B"}]
["A sín  keresztmetszeti méretei:",null,null,null,null,null,{"$f":"VLOOKUP(G275,A1457:I1476,3)","v":"125x82x16"},"mm"]
["A sínek száma:",null,null,null,null,"ZF =",2,"db"]
["Keresztmetszete:",null,null,null,null,"AF =",{"$f":"VLOOKUP(G275,A1457:I1476,5)","v":2283},"mm2"]
["Inercianyomatékai:",null,null,null,null,"IFX =",{"$f":"VLOOKUP(G275,A1457:I1476,6)","v":1510000},"mm4"]
[null,null,null,null,null,"IFY =",{"$f":"VLOOKUP(G275,A1457:I1476,7)","v":1590000},"mm4"]
["Keresztmetszeti tényezői:",null,null,null,null,"WFX =",{"$f":"VLOOKUP(G275,A1457:I1476,8)","v":26200},"mm3"]
[null,null,null,null,null,"WFY =",{"$f":"VLOOKUP(G275,A1457:I1476,9)","v":25400},"mm3"]
["Inerciasugarai:",null,null,null,null,"ix =",{"$f":"VLOOKUP(G275,A1480:G1499,3)","v":25.7},"mm"]
[null,null,null,null,null,"iy =",{"$f":"VLOOKUP(G275,A1480:G1499,4)","v":26.4},"mm"]
["A kisebbik inerciasugár:",null,null,null,"i min =",{"$f":"IF(G284<G285,F284,F285)","v":"ix ="},{"$f":"IF(G284<G285,G284,G285)","v":25.7},"mm"]
["Gerincvastagsága:",null,null,null,null,"CF =",{"$f":"VLOOKUP(G275,A1480:G1499,5)","v":10},"mm"]
["Méterenkénti tömege:",null,null,null,null,"GFM =",{"$f":"VLOOKUP(G275,A1480:G1499,6)","v":17.899999999999999},"kg/m"]
["Össztömege:",null,null,null,null,"GF = GFM * HS =",{"$f":"G288*G17","v":356.20999999999992},"kg"]
["A sín anyaga:",null,null,null,null,null,{"$f":"VLOOKUP(G275,A1480:H1499,8)","v":"ST-44"}]
["A sín anyagának rugalmassági modulusa:",null,null,null,null,"EF =",210000,"N/mm2"]
["A sín anyagának szakítószilárdsága:",null,null,null,null,"RM =",{"$f":"VLOOKUP(G275,A1480:G1499,7)","v":440},"N/mm2"]
["A sín anyagának nyúlása:",null,null,null,null,"A5 =",12,"%"]
["(Legalább 8 %, ISO 7465 szerinti sínek esetén A5 > 12 %"]
["Max. megengedett gyámtáv.:",null,null,null,null,"HF =",2500,"mm"]
["A vezetőkészülékek függőleges távolsága:",null,null,null,null,"HKF =",3000,"mm"]
[]
["Terhelési eset",null,"Szakadási nyúlás, A5",null,null,"Biztonsági tényező, B"]
["Normál üzem, berakodás",null,"> =",8,null,null,3.75]
[null,null,"> =",12,null,null,2.25]
["Fogókészülék megszólalása",null,"> =",8,null,null,3]
[null,null,"> =",12,null,null,1.8]
[]
["Biztonsági tényező és megengedett feszültség normál üzemben és berakodáskor:"]
[null,null,null,null,"a táblázatból:","B1 =",{"$f":"VLOOKUP(G293,D299:G300,4)","v":2.25}]
[null,null,null,null,null,"smeg1 = RM / B1 =",{"$f":"G292/G305","v":195.55555555555554},"N/mm2"]
["Biztonsági tényező és megengedett feszültség a fogókészülék, ill. az ütköző működésekor:"]
[null,null,null,null,"a táblázatból:","B2 =",{"$f":"VLOOKUP(G293,D301:G302,4)","v":1.8}]
[null,null,null,null,null,"smeg2 = RM / B2 =",{"$f":"G292/G308","v":244.44444444444443},"N/mm2"]
["Dinamikus tényezők:"]
["sorsz.","A dinamikus hatás",null,null,null,null,null,"KDS","KDP"]
[1,"Ékes pillanatműk. fogókészülék",null,null,"Rugalmas felületű merev (csak felújításhoz!):",null,null,5,6]
[2,"Görgős pillanatműk. fogókészülék",null,null,"Energiatároló ütk.",null,null,3,3]
[3,"Fékező fogókészülék",null,null,"Energia-elnyelő ütk.",null,null,2,2]
[4,"Csőtörésre záródó szelep fogókészülék nélkül",null,null,null,null,null,2,2]
[null,"Menet közben:     ",null,null,null,null,"KDM =",1.2]
[]
[]
[]
[]
[]
[]
[]
[]
["Karcsúsági tényező:",null,null,null,null,"l = HF / i min =",{"$f":"G295/G286","v":97.276264591439698}]
["Az w kihajlási szám RM = 370 N/mm2 esetén:",null,null,null,null,"w 370 = ",{"$f":"VLOOKUP(G325,A328:G331,7)","v":1.8436485955837483}]
[null,"l"]
[20,"tól  60 ig",null,"w = 0,00012920 * l 1,89 + 1 =",null,null,{"$f":"0.0001292*G325^1.89+1","v":1.7389167764693436}]
[60,"tól  85-ig",null,"w = 0,00004627 * l 2,14 + 1 =",null,null,{"$f":"0.00004627*G325^2.14+1","v":1.8310635487049667}]
[85,"tól 115-ig",null,"w = 0,00001711 * l 2,35 + 1,04 =",null,null,{"$f":"0.00001711*G325^2.35+1.04","v":1.8436485955837483}]
[115,"tól 250-ig",null,"w = 0,00016887 * l 2,0  =",null,null,{"$f":"0.00016887*G325^2","v":1.5979613620191073}]
["Az w kihajlási szám RM = 520 N/mm2 esetén:",null,null,null,null,"w 520 = ",{"$f":"VLOOKUP(G325,A334:G337,7)","v":2.3969231176853554}]
[null,"l"]
[20,"tól 50 ig",null,"w = 0,00008240*l2,06+1,021 =",null,null,{"$f":"0.0000824*G325^2.06+1.021","v":2.0471749184114767}]
[50,"tól  70-ig",null,"w = 0,00001895 * l 2,41 + 1,05 =",null,null,{"$f":"0.00001895*G325^2.41+1.05","v":2.2214015867472439}]
[70,"tól 89-ig",null,"w = 0,00002447 * l 2,36 + 1,03 =",null,null,{"$f":"0.00002447*G325^2.36+1.03","v":2.2331789321656181}]
[89,"tól 250-ig",null,"w = 0,000253303 * l 2,0  =",null,null,{"$f":"0.000253303*G325^2","v":2.3969231176853554}]
["Az w kihajlási szám az adott RM szakítószilárdságú anyag esetén:"]
[null,null,null,null,null,"w  = [(w 520 - w 370) * (RM - 370) / (520 - 370)] + w 370 = ",{"$f":"((G332-G326)*(G292-370)/150)+G326","v":2.101843372564498}]
[]
["A fülkei vezetősínek ellenőrzése"]
["Befogás",null,null,null,null,"sorszám (1 - 4):",2]
["Az alkalmazott fogókészülék:",null,null,{"$f":"VLOOKUP(G342,A312:H315,2)","v":"Görgős pillanatműk. fogókészülék"}]
["Az aktuális dinamikai tényező:",null,null,null,null,"KDS =",{"$f":"VLOOKUP(G342,A312:H315,8)","v":3}]
["Hajlító igénybevétel"]
["1. terhelési eset: a terhelés az x-tengely irányában aszimmetrikus:"]
[]
[]
[null,null,null,null,null,"Q = az aszimmetrikus terhelés tömegközéppontja"]
[]
[null,null,null,null,null,"C = a fülke belméreteinek geometriai középpontja"]
[]
[null,null,null,null,null,"S = az üres fülke tömegközéppontja"]
[null,null,null,null,null,"K = a függesztőerő(k) eredőjének helye"]
[]
[null,null,null,null,null,"xC = ",-150,"mm"]
[null,null,null,null,null,"xS = ",100,"mm"]
[null,null,null,null,null,"xK = ",200,"mm"]
[]
[null,null,null,null,null,"xQ1 = xC + 1/8 * TK = ",{"$f":"B1444*(ABS(G356)+G64/8)","v":-400},"mm"]
[null,null,null,null,null,"yQ1 = ",0]
[null,null,null,null,"A koordináták előjelhelyesen helyettesítendők: ha az ábrázolthoz képest ellentétes irányban helyezkednek el, negatív előjelet kapnak!"]
[]
[]
[]
[]
["Hajlító igénybevétel az y tengelyre:"]
[null,null,null,null,null,null,"FFx1 = KDS * g * [GQ * xQ1 + (GK + GU + GH)* xS] / (ZF * HKF) =",{"$f":"ABS(G344*9.81*(G9*G360+(G18+G36+G38)*G357)/(G278*G296))","v":1466.9015625},"N"]
[null,null,null,null,null,null,"My1 = 3 * FFx1 * HF / 16 =",{"$f":"3*H368*G295/16","v":687610.107421875},"Nmm"]
[null,null,null,null,null,null,"sy1 = My1 / WFY =",{"$f":"H369/G283","v":27.071264071727363},"N/mm2"]
["Hajlító igénybevétel az x tengelyre:"]
[null,"A szimmetria miatt nincs igénybevétel:",null,null,null,null,"FFy1 =",0,"N"]
[null,null,null,null,null,null,"sx1 = ",0,"N/mm2"]
[]
[]
[]
[]
[]
["2. terhelési eset: a terhelés az y-tengely irányában aszimmetrikus:"]
[]
[]
[]
[null,null,null,null,null,"xQ2  = xC = ",{"$f":"G356","v":-150},"mm"]
[]
[null,null,null,null,null,"yQ2 = 1/8 * BK =",{"$f":"G63/8","v":162.5},"mm"]
[]
[]
[]
[]
[]
[]
[]
[]
[]
[]
[]
[]
["Hajlító igénybevétel az y tengelyre:"]
[null,null,null,null,null,null,"FFx2 = KDS * g * [GQ * xQ2 + (GK + GU + GH)* xS] / (ZF * HKF) =",{"$f":"ABS(G344*9.81*(G9*G383+(G18+G36+G38)*G357)/(G278*G296))","v":209.99531250000001},"N"]
[null,null,null,null,null,null,"My2 = 3 * FFx2 * HF / 16 =",{"$f":"3*H399*G295/16","v":98435.302734375015},"Nmm"]
[null,null,null,null,null,null,"sy2 = My2 / WFY =",{"$f":"H400/G283","v":3.8754056194635833},"N/mm2"]
["Hajlító igénybevétel az x tengelyre:"]
[null,null,null,null,null,null,"FFy2 = KDS * g * [GQ * yQ2 ] / [(ZF/2) * HKF] =",{"$f":"ABS(G344*9.81*(G9*G385)/((G278/2)*G296))","v":1633.9781250000001},"N"]
[null,null,null,null,null,null,"Mx2 = 3 * FFy2 * HF / 16 =",{"$f":"3*H403*G295/16","v":765927.24609375012},"Nmm"]
[null,null,null,null,null,null,"sx2 = Mx2 / WFX =",{"$f":"H404/G282","v":29.233864354723288},"N/mm2"]
["Kihajlás:"]
[{"$f":"IF(G342<4,\" \",\"Ha nincs fogókészülék, csak csőtörésre záródó szelep, nem léphet fel kihajlás: \")","v":" "}]
[null,null,null,null,null,null,"FLB = KDS *g * (GQ + GK + GU + GH) / ZF =",{"$f":"IF(G342<4,G344*9.81*(G9+G18+G36+G38)/G278,0)","v":31407.328125},"N"]
[null,null,null,null,null,null,"sk = FLB * w / AF =",{"$f":"H408*G339/G279","v":28.915148694476482},"N/mm2"]
["Összetett feszültség:"]
[null,null,null,"sm1 = sx + sy =",{"$f":"H370+H373","v":27.071264071727363},"N/mm2",{"$f":"IF(E411>G309,\">\",\"<\")","v":"<"},"smeg2"]
[null,null,null,"sm2 = sx + sy =",{"$f":"H401+H405","v":33.109269974186873},"N/mm2",{"$f":"IF(E412>G309,\">\",\"<\")","v":"<"},"smeg2"]
[null,null,null,"s1 = sm1 + FLB / AF =",{"$f":"E411+H408/G279","v":40.828306614434325},"N/mm2",{"$f":"IF(E413>G309,\">\",\"<\")","v":"<"},"smeg2"]
[null,null,null,"s2 = sm2 + FLB / AF =",{"$f":"E412+H408/G279","v":46.866312516893835},"N/mm2",{"$f":"IF(E414>G309,\">\",\"<\")","v":"<"},"smeg2"]
[null,null,null,"sc1 = sk + 0,9 * sm1 =",{"$f":"H409+0.9*E411","v":53.279286359031104},"N/mm2",{"$f":"IF(E415>G309,\">\",\"<\")","v":"<"},"smeg2"]
[null,null,null,"sc2 = sk + 0,9 * sm2 =",{"$f":"H409+0.9*E412","v":58.713491671244668},"N/mm2",{"$f":"IF(E416>G309,\">\",\"<\")","v":"<"},"smeg2"]
[]
["Peremhajlítás:"]
[null,null,null,"sF1 = 1,85 * FFx1 /CF2 =",{"$f":"1.85*H368/G287^2","v":27.137678906249999},"N/mm2",{"$f":"IF(E419>G309,\">\",\"<\")","v":"<"},"smeg2"]
[null,null,null,"sF2 = 1,85 * FFx2 / CF2 =",{"$f":"1.85*H399/G287^2","v":3.8849132812500007},"N/mm2",{"$f":"IF(E420>G309,\">\",\"<\")","v":"<"},"smeg2"]
["Lehajlás:"]
["A megengedett legnagyobb lehajlás: fülkei, ill. fogókészülékes ellensúly-vezetősínre:"]
[null,null,null,null,null,"dx meg1 = dy meg1 =",5,"mm"]
[null,null,null,"dx1 = 0,7 *FFx1 *HF3 / (48 * IFY * EF) = ",{"$f":"0.7*H368*G295^3/(48*G281*G291)","v":1.0010629330041272},"mm",{"$f":"IF(E424>G423,\">\",\"<\")","v":"<"},"dx meg1 "]
[null,null,null,"dx2 = 0,7 *FFx2 *HF3 / (48 * IFY * EF) = ",{"$f":"0.7*H399*G295^3/(48*G281*G291)","v":0.14330785979264937},"mm",{"$f":"IF(E425>G423,\">\",\"<\")","v":"<"},"dx meg1 "]
[null,null,null,"dy1 = 0,7 *FFy1 *HF3 / (48 * IFX * EF) = ",{"$f":"0.7*H372*G295^3/(48*G280*G291)","v":0},"mm",{"$f":"IF(E426>G423,\">\",\"<\")","v":"<"},"dy meg1 "]
[null,null,null,"dy2 = 0,7 *FFy2 *HF3 / (48 * IFX * EF) = ",{"$f":"0.7*H403*G295^3/(48*G280*G291)","v":1.1741587657802153},"mm",{"$f":"IF(E427>G423,\">\",\"<\")","v":"<"},"dy meg1 "]
[]
[]
[]
[]
[]
["Ütközőre futás:",null,"Feltételezés: az ütközők a koordináta-redszer origójára szimmetrikusak"]
[null,null,null,null,null,"sorszám (1, 2, 3):",2]
["Az alkalmazott ütköző:",null,null,{"$f":"VLOOKUP(G434,A312:H314,5)","v":"Energiatároló ütk."}]
["Az aktuális dinamikai tényező:",null,null,null,null,"KDP =",{"$f":"VLOOKUP(G434,A312:I314,9)","v":3},{"$f":"IF(G436<2,\"Biztos ez?\",\" \")","v":" "}]
[]
["Hajlító igénybevétel"]
["1. terhelési eset: a terhelés az x-tengely irányában aszimmetrikus:"]
["Hajlító igénybevétel az y tengelyre:"]
[null,null,null,null,null,null,"FFx1 = KDP * g * [GQ * xQ1 + (GK + GU + GH)* xS] / (ZF * HKF) =",{"$f":"ABS(G436*9.81*(G9*G360+(G18+G36+G38)*G357)/(G278*G296))","v":1466.9015625},"N"]
[null,null,null,null,null,null,"My1 = 3 * FFx1 * HF / 16 =",{"$f":"3*H441*G295/16","v":687610.107421875},"Nmm"]
[null,null,null,null,null,null,"sy1 = My1 / WFY =",{"$f":"H442/G283","v":27.071264071727363},"N/mm2"]
["Hajlító igénybevétel az x tengelyre:"]
[null,"A szimmetria miatt nincs igénybevétel:",null,null,null,null,"FFy1 =",0,"N"]
[null,null,null,null,null,null,"sx1 = ",0,"N/mm2"]
["2. terhelési eset: a terhelés az y-tengely irányában aszimmetrikus:"]
["Hajlító igénybevétel az y tengelyre:"]
[null,null,null,null,null,null,"FFx2 = KDP * g * [GQ * xQ2 + (GK + GU + GH)* xS] / (ZF * HKF) =",{"$f":"ABS(G436*9.81*(G9*G383+(G18+G36+G38)*G383)/(G278*G296))","v":1570.36640625},"N"]
[null,null,null,null,null,null,"My2 = 3 * FFx2 * HF / 16 =",{"$f":"3*H449*G295/16","v":736109.2529296875},"Nmm"]
[null,null,null,null,null,null,"sy2 = My2 / WFY =",{"$f":"H450/G283","v":28.980679249200296},"N/mm2"]
["Hajlító igénybevétel az x tengelyre:"]
[null,null,null,null,null,null,"FFy2 = KDP * g * [GQ * yQ2 ] / [(ZF/2) * HKF] =",{"$f":"ABS(G436*9.81*(G9*G385)/((G278/2)*G296))","v":1633.9781250000001},"N"]
[null,null,null,null,null,null,"Mx2 = 3 * FFy2 * HF / 16 =",{"$f":"3*H453*G295/16","v":765927.24609375012},"Nmm"]
[null,null,null,null,null,null,"sx2 = Mx2 / WFX =",{"$f":"H454/G282","v":29.233864354723288},"N/mm2"]
["Kihajlás:"]
["Az ütközőre futáskor nem léphet fel kihajlás."]
["Összetett feszültség:"]
[null,null,null,"sm1 = sx + sy =",{"$f":"H443+H446","v":27.071264071727363},"N/mm2",{"$f":"IF(E459>G309,\">\",\"<\")","v":"<"},"smeg2"]
[null,null,null,"sm2 = sx + sy =",{"$f":"H451+H455","v":58.214543603923588},"N/mm2",{"$f":"IF(E460>G309,\">\",\"<\")","v":"<"},"smeg2"]
["Peremhajlítás:"]
[null,null,null,"sF1 = 1,85 * FFx1 /CF2 =",{"$f":"1.85*H441/G287^2","v":27.137678906249999},"N/mm2",{"$f":"IF(E462>G309,\">\",\"<\")","v":"<"},"smeg2"]
[null,null,null,"sF2 = 1,85 * FFx2 / CF2 =",{"$f":"1.85*H449/G287^2","v":29.051778515625003},"N/mm2",{"$f":"IF(E463>G309,\">\",\"<\")","v":"<"},"smeg2"]
["Lehajlás:"]
["A megengedett legnagyobb lehajlás: fülkei, ill. fogókészülékes ellensúly-vezetősínre:"]
[null,null,null,null,null,"dx meg1 = dy meg1 =",5,"mm"]
[null,null,null,"dx1 = 0,7 *FFx1 *HF3 / (48 * IFY * EF) = ",{"$f":"0.7*H441*G295^3/(48*G281*G291)","v":1.0010629330041272},"mm",{"$f":"IF(E467>G466,\">\",\"<\")","v":"<"},"dx meg1 "]
[null,null,null,"dx2 = 0,7 *FFx2 *HF3 / (48 * IFY * EF) = ",{"$f":"0.7*H449*G295^3/(48*G281*G291)","v":1.0716708201282428},"mm",{"$f":"IF(E468>G466,\">\",\"<\")","v":"<"},"dx meg1 "]
[null,null,null,"dy1 = 0,7 *FFy1 *HF3 / (48 * IFX * EF) = ",{"$f":"0.7*H445*G295^3/(48*G280*G291)","v":0},"mm",{"$f":"IF(E469>G466,\">\",\"<\")","v":"<"},"dy meg1 "]
[null,null,null,"dy2 = 0,7 *FFy2 *HF3 / (48 * IFX * EF) = ",{"$f":"0.7*H453*G295^3/(48*G280*G291)","v":1.1741587657802153},"mm",{"$f":"IF(E470>G466,\">\",\"<\")","v":"<"},"dy meg1 "]
[]
["Normál üzem - menet üzemmód"]
["Hajlító igénybevétel"]
["1. terhelési eset: a terhelés az x-tengely irányában aszimmetrikus:"]
["Hajlító igénybevétel az y tengelyre:"]
[null,null,null,null,null,null,"FFx1 = KDM*g* [GQ*(xQ1 + xK) + (GK + GU + GH)*(xS + xK)]/ZF*HKF =",{"$f":"ABS(H316*9.81*(G9*(G360+GG358)+(G18+G36+G38)*(G357+G358))/(G278*G296))","v":151.44187500000001},"N"]
[null,null,null,null,null,null,"My1 = 3 * FFx1 * HF / 16 =",{"$f":"3*H476*G295/16","v":70988.378906250015},"Nmm"]
[null,null,null,null,null,null,"sy1 = My1 / WFY =",{"$f":"H477/G283","v":2.7948180671751972},"N/mm2"]
["Hajlító igénybevétel az x tengelyre:"]
[null,"A szimmetria miatt nincs igénybevétel:",null,null,null,null,"FFy1 =",0,"N"]
[null,null,null,null,null,null,"sx1 = ",0,"N/mm2"]
[]
[]
[]
[]
[]
["2. terhelési eset: a terhelés az y-tengely irányában aszimmetrikus:"]
["Hajlító igénybevétel az y tengelyre:"]
[null,null,null,null,null,null,"FFx2 = KDM*g*[GQ*(xQ2 + xK) + (GK + GU + GH)*(xS + xK)]/ZF*HKF =",{"$f":"ABS(H316*9.81*(G9*G383+(G18+G36+G38)*G383)/(G278*G296))","v":628.14656249999996},"N"]
[null,null,null,null,null,null,"My2 = 3 * FFx2 * HF / 16 =",{"$f":"3*H489*G295/16","v":294443.70117187494},"Nmm"]
[null,null,null,null,null,null,"sy2 = My2 / WFY =",{"$f":"H490/G283","v":11.592271699680115},"N/mm2"]
["Hajlító igénybevétel az x tengelyre:"]
[null,null,null,null,null,null,"FFy2 = KDM * g * [GQ * yQ2 ] / [(ZF/2) * HKF] =",{"$f":"ABS(H316*9.81*(G9*G385)/((G278/2)*G296))","v":653.59124999999995},"N"]
[null,null,null,null,null,null,"Mx2 = 3 * FFy2 * HF / 16 =",{"$f":"3*H493*G295/16","v":306370.8984375},"Nmm"]
[null,null,null,null,null,null,"sx2 = Mx2 / WFX =",{"$f":"H494/G282","v":11.693545741889313},"N/mm2"]
["Kihajlás:"]
["A normál üzemben nem léphet fel kihajlás."]
["Összetett feszültség:"]
[null,null,null,"sm1 = sx + sy =",{"$f":"H478+H481","v":2.7948180671751972},"N/mm2",{"$f":"IF(E499>G306,\">\",\"<\")","v":"<"},"smeg1"]
[null,null,null,"sm2 = sx + sy =",{"$f":"H491+H495","v":23.285817441569428},"N/mm2",{"$f":"IF(E500>G306,\">\",\"<\")","v":"<"},"smeg1"]
[null,null,null,"s1 = sm1 + 0 =",{"$f":"E499","v":2.7948180671751972},"N/mm2",{"$f":"IF(E501>G306,\">\",\"<\")","v":"<"},"smeg1"]
[null,null,null,"s2 = sm2 + 0 =",{"$f":"E500","v":23.285817441569428},"N/mm2",{"$f":"IF(E502>G306,\">\",\"<\")","v":"<"},"smeg1"]
[]
["Peremhajlítás:"]
[null,null,null,"sF1 = 1,85 * FFx1 /CF2 =",{"$f":"1.85*H476/G287^2","v":2.8016746875000003},"N/mm2",{"$f":"IF(E505>G306,\">\",\"<\")","v":"<"},"smeg1"]
[null,null,null,"sF2 = 1,85 * FFx2 / CF2 =",{"$f":"1.85*H489/G287^2","v":11.620711406250001},"N/mm2",{"$f":"IF(E506>G306,\">\",\"<\")","v":"<"},"smeg1"]
["Lehajlás:"]
["A megengedett legnagyobb lehajlás: fülkei, ill. fogókészülékes ellensúly-vezetősínre:"]
[null,null,null,null,null,"dx meg1 = dy meg1 =",5,"mm"]
[null,null,null,"dx1 = 0,7 *FFx1 *HF3 / (48 * IFY * EF) = ",{"$f":"0.7*H476*G295^3/(48*G281*G291)","v":0.10334902589426101},"mm",{"$f":"IF(E510>G423,\">\",\"<\")","v":"<"},"dx meg1 "]
[null,null,null,"dx2 = 0,7 *FFx2 *HF3 / (48 * IFY * EF) = ",{"$f":"0.7*H489*G295^3/(48*G281*G291)","v":0.42866832805129712},"mm",{"$f":"IF(E511>G423,\">\",\"<\")","v":"<"},"dx meg1 "]
[null,null,null,"dy1 = 0,7 *FFy1 *HF3 / (48 * IFX * EF) = ",{"$f":"0.7*H480*G295^3/(48*G280*G$291)","v":0},"mm",{"$f":"IF(E512>G423,\">\",\"<\")","v":"<"},"dy meg1 "]
[null,null,null,"dy2 = 0,7 *FFy2 *HF3 / (48 * IFX * EF) = ",{"$f":"0.7*H493*G295^3/(48*G280*G291)","v":0.46966350631208603},"mm",{"$f":"IF(E513>G423,\">\",\"<\")","v":"<"},"dy meg1 "]
[]
["Normál üzem - berakodás üzemmód"]
[]
[]
[]
[]
[null,null,null,null,null,null,null,"GQ","KK"]
[null,null,null,null,null,null,null,"   < 2500",0.4]
[null,null,null,null,null,null,null,"> = 2500",0.6]
[null,null,null,null,null,null,"Villástargonca behajt:"]
[null,null,null,null,null,null,null,"> = 2500",0.85]
[null,null,null,null,null,null,"A küszöbterhelés(ek) helye:"]
[null,null,null,null,null,null,"yw1 = ",50,"mm"]
[null,null,null,null,null,null,"yw2 = ",75,"mm"]
[null,null,null,null,null,null,"a két érték közül a nagyobb:"]
[null,null,null,null,null,"yw =",{"$f":"IF(H527>H526,G527,G526)","v":"yw2 = "},{"$f":"IF(H527>H526,H527,H526)","v":75},"mm"]
[]
[null,null,null,null,null,null,"xw1 = ",900,"mm"]
[null,null,null,null,null,null,"xw2 = ",1100,"mm"]
[]
["A feltételezendő küszöb-terhelés nagysága:"]
[null,null,null,"Fw = KK * g * GQ =",{"$f":"IF(G9<2500,0.4,0.6+IF(G10>0,0.25,0))","v":0.4},"*g * GQ =",{"$f":"E535*9.81*G9","v":4022.1000000000004},"N"]
[]
[]
[]
[]
[]
[]
["Hajlító igénybevétel"]
["Hajlító igénybevétel az y tengelyre:"]
["Az első küszöbterhelésből:"]
[null,null,null,null,null,null,"FFx1 = [g*(GK+GU+GH)*(xS+xK) - Fw*(xw1-xK)]/(ZF*HKF) =",{"$f":"ABS((9.81*(G18+G36+G38)*(G357+G358)-G535*(H531-G358))/(G278*G296))","v":74.903437499999924},"N"]
["A második küszöbterhelésből:"]
[null,null,null,null,null,null,"FFx2 = [g*(GK+GU+GH)*(xS+xK) + Fw*(xw2+xK)]/(ZF*HKF) =",{"$f":"ABS((9.81*(G18+G36+G38)*(G357+G358)+G535*(H532+G358))/(G278*G296))","v":1415.6034374999999},"N"]
["A két erő közül a nagyobb:"]
[null,null,null,null,null,"FFx =",{"$f":"IF(H547>H545,\"FFx2 =\",\"FFx1 =\")","v":"FFx2 ="},{"$f":"IF(H547>H545,H547,H545)","v":1415.6034374999999},"N"]
[null,null,null,null,null,null,"My = 3 * FFx * HF / 16 =",{"$f":"3*H549*G295/16","v":663564.111328125},"Nmm"]
[null,null,null,null,null,null,"sy = My / WFY =",{"$f":"H550/G283","v":26.124571312130904},"N/mm2"]
["Hajlító igénybevétel az x tengelyre:"]
[null,null,null,null,null,null,"FFy = Fw * yw / [(ZF/2) * HKF] =",{"$f":"G535*H529/(G278*G296/2)","v":100.55249999999999},"N"]
[null,null,null,null,null,null,"Mx = 3 * FFy * HF / 16 =",{"$f":"3*H553*G295/16","v":47133.984374999993},"Nmm"]
[null,null,null,null,null,null,"sx = Mx / WFX =",{"$f":"H554/G282","v":1.7990070372137401},"N/mm2"]
["Kihajlás:"]
["\"Normál üzem - rakodás\" üzemmódban nem léphet fel kihajlás"]
["Összetett feszültség:"]
[null,null,null,"sm = sx + sy =",{"$f":"H551+H555","v":27.923578349344645},"N/mm2",{"$f":"IF(E559>G306,\">\",\"<\")","v":"<"},"smeg1"]
[null,null,null,"s = sm + 0 =",{"$f":"E559","v":27.923578349344645},"N/mm2",{"$f":"IF(E560>G306,\">\",\"<\")","v":"<"},"smeg1"]
["Peremhajlítás:"]
[null,null,null,"sF = 1,85 * FFx /CF2 =",{"$f":"1.85*H549/G287^2","v":26.188663593749997},"N/mm2",{"$f":"IF(E562>G306,\">\",\"<\")","v":"<"},"smeg1"]
["Lehajlás:"]
["A megengedett legnagyobb lehajlás: fülkei, ill. fogókészülékes ellensúly-vezetősínre:"]
[null,null,null,null,null,"dx meg1 = dy meg1 =",5,"mm"]
[null,null,null,"dx = 0,7 *FFx *HF3 / (48 * IFY * EF) = ",{"$f":"0.7*H549*G295^3/(48*G281*G291)","v":0.96605536822752869},"mm",{"$f":"IF(E566>G565,\">\",\"<\")","v":"<"},"dx meg1 "]
[null,null,null,"dy = 0,7 *FFy *HF3 / (48 * IFX * EF) = ",{"$f":"0.7*H553*G295^3/(48*G280*G291)","v":7.2255924048013231E-2},"mm",{"$f":"IF(E567>G565,\">\",\"<\")","v":"<"},"dy meg1 "]
[]
["Az ellensúly-vezetősín ellenőrzése"]
["Adatok:"]
["A sín sorszáma (1 - 20):",null,null,null,null,null,5]
["A sín ISO-kódja:",null,null,null,null,null,{"$f":"VLOOKUP(G571,A1457:I1476,2)","v":"T 75-3/A"}]
["A sín  keresztmetszeti méretei:",null,null,null,null,null,{"$f":"VLOOKUP(G571,A1457:I1476,3)","v":"75x62x10"},"mm"]
["A sínek száma:",null,null,null,null,"ZF =",2,"db"]
["Keresztmetszete:",null,null,null,null,"AF =",{"$f":"VLOOKUP(G571,A1457:I1476,5)","v":1099},"mm2"]
["Inercianyomatékai:",null,null,null,null,"IFX =",{"$f":"VLOOKUP(G571,A1457:I1476,6)","v":403500},"mm4"]
[null,null,null,null,null,"IFY =",{"$f":"VLOOKUP(G571,A1457:I1476,7)","v":264900},"mm4"]
["Keresztmetszeti tényezői:",null,null,null,null,"WFX =",{"$f":"VLOOKUP(G571,A1457:I1476,8)","v":9290},"mm3"]
[null,null,null,null,null,"WFY =",{"$f":"VLOOKUP(G571,A1457:I1476,9)","v":7060},"mm3"]
["Inerciasugarai:",null,null,null,null,"ix =",{"$f":"VLOOKUP(G571,A1480:H1499,3)","v":19.2},"mm"]
[null,null,null,null,null,"iy =",{"$f":"VLOOKUP(G571,A1480:H1499,4)","v":15.5},"mm"]
["A kisebbik inerciasugár:",null,null,null,"i min =",{"$f":"IF(G580<G581,F580,F581)","v":"iy ="},{"$f":"IF(G580<G581,G580,G581)","v":15.5},"mm"]
["Gerincvastagsága:",null,null,null,null,"CF =",{"$f":"VLOOKUP(G571,A1480:H1499,5)","v":8},"mm"]
["Méterenkénti tömege:",null,null,null,null,"GFM =",{"$f":"VLOOKUP(G571,A1480:H1499,6)","v":8.6300000000000008},"kg/m"]
["Össztömege:",null,null,null,null,"GF = GFM * HS =",{"$f":"G584*G17","v":171.73699999999999},"kg"]
["A sín anyagának rugalmassági modulusa:",null,null,null,null,"EF =",210000,"N/mm2"]
["A sín anyaga:",null,null,null,null,null,{"$f":"VLOOKUP(G571,A1480:H1499,8)","v":"ST-37"}]
["A sín anyagának szakítószilárdsága:",null,null,null,null,"RM =",{"$f":"VLOOKUP(G571,A1480:H1499,7)","v":370},"N/mm2"]
["A sín anyagának nyúlása:",null,null,null,null,"A5 =",12,"%"]
["(Legalább 8 %, ISO 7465 szerinti sínek esetén A5 > 12 %"]
["Max. megengedett gyámtáv.:",null,null,null,null,"HF =",{"$f":"G295","v":2500},"mm"]
["Az ellensúly szélessége:",null,null,null,null,"BG =",1000,"mm"]
["Az ellensúly vastagsága:",null,null,null,null,"TG =",300,"mm"]
[]
[]
["Az ellensúly elméleti excentricitása az x-tengely irányában:"]
[null,null,null,null,null,"ex =",50,"mm"]
["Az ellensúly elméleti excentricitása az y-tengely irányában:"]
[null,null,null,null,null,"ey =",25]
["A vezetőkészülékek függőleges távolsága:",null,null,null,null,"HGF =",2500,"mm"]
[]
["Terhelési eset",null,"Szakadási nyúlás, A5",null,null,"Biztonsági tényező, B"]
["Normál üzem",null,"> =",8,null,null,3.75]
[null,null,"> =",12,null,null,2.25]
["Fogókészülék megszólalása",null,"> =",8,null,null,3]
[null,null,"> =",12,null,null,1.8]
["Biztonsági tényező és megengedett feszültség normál üzemben:"]
[null,null,null,null,"a táblázatból:","B1 =",{"$f":"VLOOKUP(G589,D603:G604,4)","v":2.25}]
[null,null,null,null,null,"smeg1 = RM / B1 =",{"$f":"G588/G608","v":164.44444444444446},"N/mm2"]
["Biztonsági tényező és megengedett feszültség a fogókészülék működésekor:"]
[null,null,null,null,"a táblázatból:","B2 =",{"$f":"VLOOKUP(G589,D605:G606,4)","v":1.8}]
[null,null,null,null,null,"smeg2 = RM / B2 =",{"$f":"G588/G611","v":205.55555555555554},"N/mm2"]
["Dinamikus tényezők:"]
["sorsz.","A dinamikus hatás",null,null,null,null,null,"KDS","KDP"]
[0,"Nincs fogókészülék",null,null,"Nincs ütköző?",null,null,0,1.2]
[1,"Ékes pillanatműk. fogók.",null,null,"Rugalmas felületű merev (csak felújításhoz!)",null,null,5,6]
[2,"Görgős pillanatműk. fogókész.",null,null,"Energiatároló ütk.",null,null,3,3]
[3,"Fékező fogókész.",null,null,"Energia-elnyelő ütk.",null,null,2,2]
[null,"Menet közben:     ",null,null,null,null,"KDM =",1.2]
[]
["Karcsúsági tényező:",null,null,null,null,"l = HF / i min =",{"$f":"G591/G582","v":161.29032258064515}]
["Az w kihajlási szám RM = 370 N/mm2 esetén:",null,null,null,null,"w 370 = ",{"$f":"VLOOKUP(G621,A624:G627,7)","v":4.3930801248699263}]
[null,"l"]
[20,"tól  60 ig",null,"w = 0,00012920 * l 1,89 + 1 =",null,null,{"$f":"0.0001292*G621^1.89+1","v":2.9215081042531401}]
[60,"tól  85-ig",null,"w = 0,00004627 * l 2,14 + 1 =",null,null,{"$f":"0.00004627*G621^2.14+1","v":3.4523433994592594}]
[85,"tól 115-ig",null,"w = 0,00001711 * l 2,35 + 1,04 =",null,null,{"$f":"0.00001711*G621^2.35+1.04","v":3.6771178550597901}]
[115,"tól 250-ig",null,"w = 0,00016887 * l 2,0  =",null,null,{"$f":"0.00016887*G621^2","v":4.3930801248699263}]
["Az w kihajlási szám RM = 520 N/mm2 esetén:",null,null,null,null,"w 520 = ",{"$f":"VLOOKUP(G621,A630:G633,7)","v":6.5895681581685741}]
[null,"l"]
[20,"tól 50 ig",null,"w = 0,00008240*l2,06+1,021 =",null,null,{"$f":"0.0000824*G621^2.06+1.021","v":3.9290397013278606}]
[50,"tól  70-ig",null,"w = 0,00001895 * l 2,41 + 1,05 =",null,null,{"$f":"0.00001895*G621^2.41+1.05","v":5.0122807326682119}]
[70,"tól 89-ig",null,"w = 0,00002447 * l 2,36 + 1,03 =",null,null,{"$f":"0.00002447*G621^2.36+1.03","v":4.9981637199824727}]
[89,"tól 250-ig",null,"w = 0,000253303 * l 2,0  =",null,null,{"$f":"0.000253303*G621^2","v":6.5895681581685741}]
[]
["Az w kihajlási szám az adott RM szakítószilárdságú anyag esetén:"]
[]
[null,null,null,null,null,"w  = [(w 520 - w 370) * (RM - 370) / (520 - 370)] + w 370 = ",{"$f":"((G628-G622)*(G588-370)/150)+G622","v":4.3930801248699263}]
[]
[]
[]
[]
[]
[]
[]
[]
[]
[]
[]
[]
["Az ellensúly feltételezett eredő excentricitásai:"]
[null,null,null,null,null,"eGx = ex + 0,05 * BG =",{"$f":"ABS(G597)+0.05*G592","v":100},"mm"]
[null,null,null,null,null,"eGy = ey + 0,10 * TG =",{"$f":"ABS(G599)+0.1*G593","v":55},"mm"]
["Befogás:"]
[null,null,null,null,null,"sorszám (0 - 3):",0]
["Az alkalmazott fogókészülék:",null,null,{"$f":"VLOOKUP(G654,A615:D618,2)","v":"Nincs fogókészülék"}]
["Az aktuális dinamikai tényező:",null,null,null,null,"KDS =",{"$f":"VLOOKUP(G654,A615:H618,8)","v":0}]
["Hajlító igénybevétel"]
["Hajlító igénybevétel az y tengelyre:"]
[null,null,null,null,null,"FFx = KDS * g * (GG + GU + GH) * eGx / (ZF *HGF) =",{"$f":"ABS(G656*9.81*(G20+G36+G38)*G651/(G574*G600))","v":0},"N"]
[null,null,null,null,null,"My = 3 * FFx * HF / 16 =",{"$f":"3*G659*G591/16","v":0},"Nmm"]
[null,null,null,null,null,"sy = My / WFY =",{"$f":"G660/G579","v":0},"N/mm2"]
["Hajlító igénybevétel az x tengelyre:"]
[null,null,null,null,null,"FFy = KDS * g * (GG + GU + GH) * eGy / HGF =",{"$f":"ABS(G656*9.81*(G20+G36+G38)*G652/G600)","v":0},"N"]
[null,null,null,null,null,"Mx = 3 * FFy * HF / 16 =",{"$f":"3*G663*G591/16","v":0},"Nmm"]
[null,null,null,null,null,"sx = Mx / WFX =",{"$f":"G664/G578","v":0},"N/mm2"]
["Kihajlás:"]
[{"$f":"IF(G654<1,\"Az ellensúlyon nincs fogókészülék, nem léphet fel kihajlás\",\" \")","v":"Az ellensúlyon nincs fogókészülék, nem léphet fel kihajlás"}]
[null,null,null,null,null,"FLB = KDS *g * (GG + GU + GH) / ZF =",{"$f":"IF(G654>0,G656*9.81*(G20+G36+G38)/G574,0)","v":0},"N"]
[null,null,null,null,null,"sk = FLB * w / AF =",{"$f":"G668*G637/G575","v":0},"N/mm2"]
["Összetett feszültség:"]
[null,null,null,"sm = sx + sy =",{"$f":"G665+G661","v":0},"N/mm2",{"$f":"IF(E671>G612,\">\",\"<\")","v":"<"},"smeg2"]
[null,null,null,"s = sm + FLB / AF =",{"$f":"E671+G668/G575","v":0},"N/mm2",{"$f":"IF(E672>G612,\">\",\"<\")","v":"<"},"smeg2"]
[null,null,null,"sc = sk + 0,9 * sm1 =",{"$f":"G669+0.9*E671","v":0},"N/mm2",{"$f":"IF(E673>G612,\">\",\"<\")","v":"<"},"smeg2"]
["Peremhajlítás:"]
[null,null,null,"sF = 1,85 * FFx /CF2 =",{"$f":"1.85*G659/G583^2","v":0},"N/mm2",{"$f":"IF(E675>G612,\">\",\"<\")","v":"<"},"smeg2"]
["Lehajlás:"]
["A megengedett legnagyobb lehajlás: fülkei, ill. fogókészülékes ellensúly-vezetősínre:"]
[null,null,null,null,null,"dx meg1 = dy meg1 =",5,"mm"]
[null,null,null,"dx1 = 0,7 *FFx *HF3 / (48 * IFY * EF) = ",{"$f":"0.7*G659*G591^3/(48*G577*G586)","v":0},"mm",{"$f":"IF(E679>G678,\">\",\"<\")","v":"<"},"dx meg1 "]
[null,null,null,"dy1 = 0,7 *FFy *HF3 / (48 * IFX * EF) = ",{"$f":"0.7*G663*G591^3/(48*G576*G586)","v":0},"mm",{"$f":"IF(E680>G678,\">\",\"<\")","v":"<"},"dy meg1 "]
[]
["Ütközőre futás:"]
[null,null,null,null,null,"sorszám (1, 2, 3)",2]
["Az alkalmazott ütköző:",null,null,{"$f":"VLOOKUP(G683,A615:I618,5)","v":"Energiatároló ütk."}]
["Az aktuális dinamikai tényező:",null,null,null,null,"KDP =",{"$f":"VLOOKUP(G683,A615:I618,9)","v":3}]
["Hajlító igénybevétel"]
["Hajlító igénybevétel az y tengelyre:"]
[null,null,null,null,null,"FFx = KDP * g * (GG + GU + GH) * eGx / (ZF *HGF) =",{"$f":"ABS(G685*9.81*(G20+G36+G38)*G651/(G574*G600))","v":954.635625},"N"]
[null,null,null,null,null,"My = 3 * FFx * HF / 16 =",{"$f":"3*G688*G591/16","v":447485.44921875},"Nmm"]
[null,null,null,null,null,"sy = My / WFY =",{"$f":"G689/G579","v":63.383208104638811},"N/mm2"]
["Hajlító igénybevétel az x tengelyre:"]
[null,null,null,null,null,"FFy = KDP * g * (GG + GU + GH) * eGy / HGF =",{"$f":"ABS(G685*9.81*(G20+G36+G38)*G652/G600)","v":1050.0991875},"N"]
[null,null,null,null,null,"Mx = 3 * FFy * HF / 16 =",{"$f":"3*G692*G591/16","v":492233.994140625},"Nmm"]
[null,null,null,null,null,"sx = Mx / WFX =",{"$f":"G693/G578","v":52.985359972080197},"N/mm2"]
["Kihajlás:"]
["Ütközőre futáskor nem jön létre kihajlás."]
[]
["Összetett feszültség:"]
[null,null,null,"sm = sx + sy =",{"$f":"G694+G690","v":116.36856807671901},"N/mm2",{"$f":"IF(E699>G612,\">\",\"<\")","v":"<"},"smeg2"]
["Peremhajlítás:"]
[null,null,null,"sF = 1,85 * FFx /CF2 =",{"$f":"1.85*G688/G583^2","v":27.594936035156252},"N/mm2",{"$f":"IF(E701>G612,\">\",\"<\")","v":"<"},"smeg2"]
[]
[]
[]
["Lehajlás:"]
["A megengedett legnagyobb lehajlás: fülkei, ill. fogókészülékes ellensúly-vezetősínre:"]
[null,null,null,null,null,"dx meg1 = dy meg1 =",5,"mm"]
[null,null,null,"dx1 = 0,7 *FFx *HF3 / (48 * IFY * EF) = ",{"$f":"0.7*G688*G591^3/(48*G577*G586)","v":3.9103282267483013},"mm",{"$f":"IF(E708>G707,\">\",\"<\")","v":"<"},"dx meg1 "]
[null,null,null,"dy1 = 0,7 *FFy *HF3 / (48 * IFX * EF) = ",{"$f":"0.7*G692*G591^3/(48*G576*G586)","v":2.823867514230948},"mm",{"$f":"IF(E709>G707,\">\",\"<\")","v":"<"},"dy meg1 "]
[]
["Normál üzem:"]
["Hajlító igénybevétel"]
["Hajlító igénybevétel az y tengelyre:"]
[null,null,null,null,null,"FFx = KDM * g * (GG + GU + GH) * eGx / (ZF *HGF) =",{"$f":"ABS(H619*9.81*(G20+G36+G38)*G651/(G574*G600))","v":381.85425000000004},"N"]
[null,null,null,null,null,"My = 3 * FFx * HF / 16 =",{"$f":"3*G714*G591/16","v":178994.1796875},"Nmm"]
[null,null,null,null,null,"sy = My / WFY =",{"$f":"G715/G579","v":25.353283241855525},"N/mm2"]
["Hajlító igénybevétel az x tengelyre:"]
[null,null,null,null,null,"FFy = KDM * g * (GG + GU + GH) * eGy / HGF =",{"$f":"ABS(H619*9.81*(G20+G36+G38)*G652/G600)","v":420.03967499999999},"N"]
[null,null,null,null,null,"Mx = 3 * FFy * HF / 16 =",{"$f":"3*G718*G591/16","v":196893.59765625},"Nmm"]
[null,null,null,null,null,"sx = Mx / WFX =",{"$f":"G719/G578","v":21.194143988832078},"N/mm2"]
["Kihajlás:"]
["Normál üzemben nem léphet fel kihajlás"]
[]
["Összetett feszültség:"]
[null,null,null,"sm = sx + sy =",{"$f":"G716+G720","v":46.547427230687603},"N/mm2",{"$f":"IF(E725>G609,\">\",\"<\")","v":"<"},"smeg1"]
["Peremhajlítás:"]
[null,null,null,"sF = 1,85 * FFx /CF2 =",{"$f":"1.85*G714/G583^2","v":11.037974414062502},"N/mm2",{"$f":"IF(E727>G609,\">\",\"<\")","v":"<"},"smeg1"]
["Lehajlás:"]
["A megengedett legnagyobb lehajlás: fülkei, ill. fogókészülékes ellensúly-vezetősínre:"]
[null,null,null,null,null,"dx meg1 = dy meg1 =",5,"mm"]
[null,null,null,"dx = 0,7 *FFx *HF3 / (48 * IFY * EF) = ",{"$f":"0.7*G714*G591^3/(48*G577*G586)","v":1.5641312906993206},"mm",{"$f":"IF(E731>G730,\">\",\"<\")","v":"<"},"dx meg1 "]
[null,null,null,"dy = 0,7 *FFy *HF3 / (48 * IFX * EF) = ",{"$f":"0.7*G718*G591^3/(48*G576*G586)","v":1.1295470056923791},"mm",{"$f":"IF(E732>G730,\">\",\"<\")","v":"<"},"dy meg1 "]
[]
[]
["Hajtótárcsa tengely:",null,null,"Hajtómű típusa: ",null,null,"W125 V"]
["A hajtótárcsa-tengely kialakítása: kéttámaszú, konzolos"]
[]
[]
[]
[]
[]
[null,null,null,null,null,"a =",150,"mm"]
[null,null,null,null,null,"b =",100,"mm"]
[null,null,null,null,null,"d =",65,"mm"]
[]
[]
["Kifáradással szemben megkívánt bizt. tényező:",null,null,null,null,"nv0 =",1.7]
["A szakítószilárdsággal szemben megkívánt biztonsági tényező:"]
[null,null,null,null,null,"n0 =",9]
["Keresztmetszeti tényező:",null,null,null,null,"W = d3 * p / 32 =",{"$f":"POWER(G744,3)*PI()/32","v":26961.246327878031},"mm3"]
[null,null,null,null,null,"Anyag: ","C45K"]
[null,null,null,null,"Szakitószilárdság:","sB =",618,"N/mm2"]
[null,null,null,null,"Kifáradási határ:","sv =",294,"N/mm2"]
[null,null,null,null,"Aknahatásfok:","hs =",0.77]
["Gátlástényező:",null,null,null,null,"bs = b's / (b1 * b2) = 1 / (0,6 * 1) =",{"$f":"1/(0.6*1)","v":1.6666666666666667}]
["Redukált középfeszültség:"]
[null,null,null,null,null,"smr = (GQ/2 + GT + GK) * g * DD / (2 * hs * W * KZU) =",{"$f":"(G9/2+G10+G18)*9.81*G39/(2*G754*G750*G12)","v":108.58076710699164},"N/mm2"]
["A csavaró feszültség:"]
[null,null,null,null,null,"t = (GQ/2 + GT + GK) * g * DD / (4 * hs * W * KZU) =",{"$f":"(G9/2+G10+G18)*9.81*G39/(4*G754*G750*G12)","v":54.290383553495822},"N/mm2"]
["A legnagyobb hajlítónyomaték"]
[null,null,null,null,null,"MH = FDR * b = ",{"$f":"+H1504*G743","v":1915113.5955000001},"Nmm"]
["A legnagyobb hajlítófeszültség-amplitudó:"]
[null,null,null,null,null,"sa0 = MH / W =",{"$f":"+G761/G750","v":71.032087026324348},"N/mm2"]
["Az egyenértékű redukált feszültség Huber-Mises-Henky szerint:"]
[]
[null,null,null,null,null,"     sR =      sa02 + 3 * t2  =       ",{"$f":"(G763^2+3*G759^2)^0.5","v":117.84691182407957},"N/mm2"]
[]
[]
["A kifáradással szembeni biztonsági  tényező a Haigh-diagram alapján:"]
[null,null,null,null,null,"NV = sv * (1 - smr / sv * tg10o) / (b * sR) =",{"$f":"+G753*(1-G757/G753*TAN(0.1745329))/(G755*G766)","v":1.3993796514815371},{"$f":"IF(G770>I770,\">\",\"<\")","v":"<"},1.7]
[null,null,null,null,null,null,{"$f":"IF(G770>I770,\"tehát a tengely megfelel.\",\"nem felel meg\")","v":"nem felel meg"}]
[]
["A biztonsági tényező a szakítószilárdsággal szemben:"]
[null,null,null,null,null,"  N = sB / sR =",{"$f":"+G752/G766","v":5.2440915967534458},{"$f":"IF(G774>I774,\">\",\"<\")","v":"<"},9]
[null,null,null,null,null,null,{"$f":"IF(G774>I774,\"tehát a tengely megfelel.\",\"nem felel meg\")","v":"nem felel meg"}]
[]
["Hajtótárcsa tengely:",null,null,"Hajtómű típusa: ",null,null,"W250"]
["A hajtótárcsa-tengely kialakítása: háromtámaszú"]
[]
[]
[]
[]
[null,null,null,null,null,"L =",860,"mm"]
[null,null,null,null,null,"a =",540,"mm"]
[null,null,null,null,null,"b =",300,"mm"]
[null,null,null,null,null,"d1 =",100,"mm"]
[null,null,null,null,null,"d2 =",100,"mm"]
[]
[]
[]
[]
[]
[]
[]
[]
[]
[]
[]
["Kifáradással szemben megkívánt bizt. tényező:",null,null,null,null,"nv0 =",1.7]
["A szakítószilárdsággal szemben megkívánt biztonsági tényező:"]
[null,null,null,null,null,"n0 =",9]
["Keresztmetszeti tényezők:",null,null,null,null,"W1 = d13 * p / 32 =",{"$f":"POWER(G786,3)*PI()/32","v":98174.770424681032},"mm3"]
[null,null,null,null,null,"W2 = d23 * p / 32 =",{"$f":"POWER(G787,3)*PI()/32","v":98174.770424681032},"mm3"]
[null,null,null,null,null,"Anyag: ","C45K"]
[null,null,null,null,"Szakitószilárdság:","sB =",618,"N/mm2"]
[null,null,null,null,"Kifáradási határ:","sv =",294,"N/mm2"]
[null,null,null,null,"Aknahatásfok:","hs =",0.77]
["Gátlástényező:",null,null,null,null,"bs = b's / (b1 * b2) = 1 / (0,6 * 1) =",{"$f":"1/(0.6*1)","v":1.6666666666666667}]
["Redukált középfeszültség:"]
[null,null,null,null,null,"smr1 = (GQ/2 + GT + GK) * g * DD / (2 * hs * W1 * KZU) =",{"$f":"(G9/2+G10+G18)*9.81*G39/(2*G807*G802*G12)","v":29.818993166757586},"N/mm2"]
[null,null,null,null,null,"smr2 = (GQ/2 + GT + GK) * g * DD / (2 * hs * W2 * KZU) =",{"$f":"(G9/2+G10+G18)*9.81*G39/(2*G807*G803*G12)","v":29.818993166757586},"N/mm2"]
["A csavaró feszültség:"]
[null,null,null,null,null,"t1 = (GQ/2 + GT + GK) * g * DD / (4 * hs * W1 * KZU) =",{"$f":"(G9/2+G10+G18)*9.81*G39/(4*G807*G802*G12)","v":14.909496583378793},"N/mm2"]
[null,null,null,null,null,"t2 = (GQ/2 + GT + GK) * g * DD / (4 * hs * W2 * KZU) =",{"$f":"(G9/2+G10+G18)*9.81*G39/(4*G807*G803*G12)","v":14.909496583378793},"N/mm2"]
["A legnagyobb hajlítónyomatékok:"]
[null,null,null,null,null,"Mh1 = FDR * b * (a2 - b2) / 2 * L * a = ",{"$f":"+H1504*G785*(G784^2-G785^2)/(2*G783*G784)","v":1247050.7133488373},"Nmm"]
[null,null,null,null,null,"Mh2 = [FDR * (a - b) - Mh1] * b / a  = ",{"$f":"+(H1504*(G784-G785)-G816)*G785/G784","v":1860678.8421395349},"Nmm"]
[]
[]
["A legnagyobb hajlítófeszültség-amplitudó:"]
[null,null,null,null,null,"sa1 = Mh1 / W1 =",{"$f":"+G816/G802","v":12.702354260207469},"N/mm2"]
[null,null,null,null,null,"sa2 = Mh2 / W2 =",{"$f":"+G817/G803","v":18.95271905491273},"N/mm2"]
["Az egyenértékű redukált feszültség Huber-Mises-Henky szerint:"]
[]
[null,null,null,null,null,"     sR1 =      sa12 + 3 * t12  =      ",{"$f":"(G821^2+3*G813^2)^0.5","v":28.778969211234141},"N/mm2"]
[]
[null,null,null,null,null,"     sR2 =      sa22 + 3 * t22  =      ",{"$f":"(G822^2+3*G814^2)^0.5","v":32.032558821983045},"N/mm2"]
[]
["A kifáradással szembeni biztonsági  tényezők a Haigh-diagram alapján:"]
[null,null,null,null,null,"Nv1 = sv * (1 - smr1 / sv * tg10o) / (b * sR1) =",{"$f":"+G806*(1-G810/G806*TAN(0.1745329))/(G808*G825)","v":6.0198564922028623},{"$f":"IF(G830>I830,\">\",\"<\")","v":">"},1.7]
[null,null,null,null,null,null,{"$f":"IF(G830>I830,\"tehát a keresztmetszet kifáradásra megfelel.\",\"nem felel meg\")","v":"tehát a keresztmetszet kifáradásra megfelel."}]
[null,null,null,null,null,"Nv2 = sv * (1 - smr2 / sv * tg10o) / (b * sR2) =",{"$f":"+G806*(1-G811/G806*TAN(0.1745329))/(G808*G827)","v":5.4084116603966335},{"$f":"IF(G832>I832,\">\",\"<\")","v":">"},1.7]
[null,null,null,null,null,null,{"$f":"IF(G832>I832,\"tehát a keresztmetszet kifáradásra megfelel.\",\"nem felel meg\")","v":"tehát a keresztmetszet kifáradásra megfelel."}]
["A biztonsági tényezők a szakítószilárdsággal szemben:"]
[null,null,null,null,null,"  N1 = sB / sR1 =",{"$f":"+G805/G825","v":21.474014425741068},{"$f":"IF(G835>I835,\">\",\"<\")","v":">"},9]
[null,null,null,null,null,null,{"$f":"IF(G835>I835,\"tehát a keresztmetszet megfelel.\",\"nem felel meg\")","v":"tehát a keresztmetszet megfelel."}]
[null,null,null,null,null,"  N2 = sB / sR2 =",{"$f":"+G805/G827","v":19.292870214785463},{"$f":"IF(G837>I837,\">\",\"<\")","v":">"},9]
[null,null,null,null,null,null,{"$f":"IF(G837>I837,\"tehát a keresztmetszet megfelel.\",\"nem felel meg\")","v":"tehát a keresztmetszet megfelel."}]
[]
["Terelőtárcsa tengely:",null,null,null,{"$f":"IF(G46=0,\"Nincs terelés, töröld !\",\" \")","v":" "}]
["A terelőtárcsa-tengely kialakítása: álló tengely, kéttámaszú"]
[]
[null,null,null,null,null,"Hajtómű típusa: ","W125 V"]
[]
[null,null,null,null,null,"a =",80,"mm"]
[null,null,null,null,null,"b =",112,"mm"]
[null,null,null,null,null,"c =",50,"mm"]
[null,null,null,null,null,"L = a + b + c =",{"$f":"G845+G846+G847","v":242},"mm"]
[null,null,null,null,null,"d =",60,"mm"]
[]
[]
["A szakítószilárdsággal szemben megkívánt biztonsági tényező:"]
[null,null,null,null,null,"n0 =",7]
["Keresztmetszeti tényező:",null,null,null,null,"W = d3 * p / 32 =",{"$f":"POWER(G849,3)*PI()/32","v":21205.750411731104},"mm3"]
[null,null,null,null,null,"Anyag: ","C45K"]
[null,null,null,null,"Szakítószilárdság:","sB =",618,"N/mm2"]
["A  hajlítónyomatékok:"]
[null,null,null,null,null,"MH1 = FDR * a * (c + 2 * b) / (2 * L) = ",{"$f":"H102*G845*(2*G846+G847)/(2*G848)","v":96382.632496813007},"Nmm"]
[null,null,null,null,null,"MH2 = FDR * b * (c + 2 * a) / (2 *L) = ",{"$f":"H102*G846*(2*G845+G847)/(2*G848)","v":103417.86114621542},"Nmm"]
["A nagyobb hajlítónyomaték:"]
[null,null,null,null,null,{"$f":"IF(G859>G858,\"MH = MH2 =\",\"MH = MH1 =\")","v":"MH = MH2 ="},{"$f":"IF(G859>G858,G859,G858)","v":103417.86114621542},"Nmm"]
["A hajlítófeszültség a nagyobb nyomatékból:"]
[null,null,null,null,null,"s = MH1 / W =",{"$f":"+G861/G854","v":4.8768781645663557},"N/mm2"]
["A tengely csavarásra nincs igénybe véve, ezért  ",null,null,null,null,null,"  s = sR"]
["A biztonsági tényező a szakítószilárdsággal szemben:"]
[null,null,null,null,null,"  N = sB / sR =",{"$f":"+G856/G863","v":126.72040989052503},{"$f":"IF(G866>I866,\">\",\"<\")","v":">"},7]
[null,null,null,null,null,null,{"$f":"IF(G866>I866,\"tehát a tengely megfelel.\",\"nem felel meg\")","v":"tehát a tengely megfelel."}]
[]
["Fülkei függesztőtárcsa-tengely:",null,null,null,null,{"$f":"IF(G12<2,\"Nincs függesztőtárcsa, töröld !\",\" \")","v":" "},{"$f":"IF(G12=1,\"Közvetlen függesztés, töröld!\",\" \")","v":" "}]
["A függesztőtárcsa-tengely kialakítása: álló tengely, kéttámaszú"]
[null,null,null,null,null,"A fülkei függesztőtárcsák száma (1 vagy 2):"]
[null,null,null,null,null,"NF =",2,"db kötéltárcsa"]
[null,null,null,null,null,null,"A kötélerők eredője: ",{"$f":"IF(G872>1,\"45 fokos\",\"függőleges\")","v":"45 fokos"}]
[null,null,null,null,null,"a =",78,"mm"]
[null,null,null,null,null,"b =",86,"mm"]
[null,null,null,null,null,"c =",56,"mm"]
[null,null,null,null,null,"L = a + b + c =",{"$f":"G874+G875+G876","v":220},"mm"]
[null,null,null,null,null,"d =",60,"mm"]
[]
[]
["A szakítószilárdsággal szemben megkívánt biztonsági tényező:"]
[null,null,null,null,null,"n0 =",7]
["Keresztmetszeti tényező:",null,null,null,null,"W = d3 * p / 32 =",{"$f":"POWER(G878,3)*PI()/32","v":21205.750411731104},"mm3"]
[null,null,null,null,null,"Anyag: ","C45K"]
[null,null,null,null,"Szakítószilárdság:","sB =",618,"N/mm2"]
["A tengelyt terhelő erő:"]
[null,null,null,null,null,{"$f":"IF(G872>1,\"FF = (GQ + GK + GT + GU + GH) * g * (2)^0,5 / KZU =\",\"FF = (GQ + GK + GT + GU + GH) * g  =\")","v":"FF = (GQ + GK + GT + GU + GH) * g * (2)^0,5 / KZU ="},{"$f":"IF(G872>1,(G9+G18+G10+G36+G38)*9.81*SQRT(2)/G12,(G9+G18+G10+G36+G38)*9.81)","v":14805.556464092318},"N"]
["A  hajlítónyomatékok:"]
[null,null,null,null,null,"MH1 = FF * a * (c + 2 * b) / (2 * L) = ",{"$f":"G887*G874*(2*G875+G876)/(2*G877)","v":598413.67308504041},"Nmm"]
[null,null,null,null,null,"MH2 = FF * b * (c + 2 * a) / (2 * L) = ",{"$f":"G887*G875*(2*G874+G876)/(2*G877)","v":613488.42148484359},"Nmm"]
["A nagyobb hajlítónyomaték:"]
[null,null,null,null,null,{"$f":"IF(G890>G889,\"MH = MH2 =\",\"MH = MH1 =\")","v":"MH = MH2 ="},{"$f":"IF(G890>G889,G890,G889)","v":613488.42148484359},"Nmm"]
["A hajlítófeszültség a nagyobb nyomatékból:"]
[null,null,null,null,null,"s = MH1 / W =",{"$f":"+G892/G883","v":28.930285869320588},"N/mm2"]
["A tengely csavarásra nincs igénybe véve, ezért  ",null,null,null,null,null,"  s = sR"]
["A biztonsági tényező a szakítószilárdsággal szemben:"]
[null,null,null,null,null,"  N = sB / sR =",{"$f":"+G885/G894","v":21.36169697014174},{"$f":"IF(G897>I897,\">\",\"<\")","v":">"},7]
[null,null,null,null,null,null,{"$f":"IF(G897>I897,\"tehát a tengely megfelel.\",\"nem felel meg\")","v":"tehát a tengely megfelel."}]
[]
["Ellensúly függesztőtárcsa-tengelye:",null,null,null,null,{"$f":"IF(G12<2,\"Nincs függesztőtárcsa, töröld !\",\" \")","v":" "}]
["A függesztőtárcsa-tengely kialakítása: álló tengely, kéttámaszú"]
[null,null,null,null,null,null,"A  függesztőtárcsák elrendezése:",2]
[null,null,null,null,null,"(\"1\" = egy db függesztőtárcsa)"]
[null,null,null,null,null,"(\"2\" = két db tárcsa, 2x180o, \"bajusz\")"]
[null,null,null,null,null,"(\"3\" = két db tárcsa 2 x 90o-os tereléssel)"]
[null,null,null,null,null,"NF =",{"$f":"IF(H902>1,2,1)","v":2},"db kötéltárcsa"]
[null,null,null,null,null,"a =",78,"mm"]
[null,null,null,null,null,"b =",86,"mm"]
[null,null,null,null,null,"c =",56,"mm"]
[null,null,null,null,null,"L = a + b + c =",{"$f":"G907+G908+G909","v":220},"mm"]
[null,null,null,null,null,"d =",60,"mm"]
["A szakítószilárdsággal szemben megkívánt biztonsági tényező:"]
[null,null,null,null,null,"n0 =",7]
["Keresztmetszeti tényező:",null,null,null,null,"W = d3 * p / 32 =",{"$f":"POWER(G911,3)*PI()/32","v":21205.750411731104},"mm3"]
[null,null,null,null,null,"Anyag: ","C45K"]
[null,null,null,null,"Szakítószilárdság:","sB =",618,"N/mm2"]
["A tengelyt terhelő erő:"]
[null,null,null,null,null,{"$f":"IF(H902>2,\"FF = (GG +  GU ) * g * (2)^0,5 / KZU =\",\"FF = (GG + GU) * g / NF  =\")","v":"FF = (GG + GU) * g / NF  ="},{"$f":"IF(H902>2,(G20+G36)*9.81*SQRT(2)/G12,(G20+G36)*9.81/G906)","v":7909.3125},"N"]
["A  hajlítónyomatékok:"]
[null,null,null,null,null,"MH1 = FF * a * (c + 2 * b) / (2 * L) = ",{"$f":"G918*G907*(2*G908+G909)/(2*G910)","v":319680.0306818182},"Nmm"]
[null,null,null,null,null,"MH2 = FF * b * (c + 2 * a) / (2 * L) = ",{"$f":"G918*G908*(2*G907+G909)/(2*G910)","v":327733.14886363636},"Nmm"]
["A nagyobb hajlítónyomaték:"]
[null,null,null,null,null,{"$f":"IF(G921>G920,\"MH = MH2 =\",\"MH = MH1 =\")","v":"MH = MH2 ="},{"$f":"IF(G921>G920,G921,G920)","v":327733.14886363636},"Nmm"]
["A hajlítófeszültség a nagyobb nyomatékból:"]
[null,null,null,null,null,"s = MH1 / W =",{"$f":"+G923/G914","v":15.454918713102137},"N/mm2"]
["A tengely csavarásra nincs igénybe véve, ezért  ",null,null,null,null,null,"  s = sR"]
["A biztonsági tényező a szakítószilárdsággal szemben:"]
[null,null,null,null,null,"  N = sB / sR =",{"$f":"+G916/G925","v":39.987269520614255},{"$f":"IF(G928>I928,\">\",\"<\")","v":">"},7]
[null,null,null,null,null,null,{"$f":"IF(G928>I928,\"tehát a tengely megfelel.\",\"nem felel meg\")","v":"tehát a tengely megfelel."}]
[]
[]
[]
[]
[]
[]
[]
[]
[]
[]
[]
[]
[]
[]
[]
[]
[]
[]
[]
[]
[]
[]
[]
[]
[]
[]
[]
[]
[]
["Fülke-vázszerkezet"]
["Felső tartó"]
["A tartó profilja (\"1\" = hengerelt profil, \"2\" = egyéb):",null,null,null,null,null,1]
["A függesztőtárcsák száma (\"1\" vagy \"2\", közvetlen kötélbekötésnél: \"1\"):",null,null,null,null,null,null,null,{"$f":"IF(AND(G963=1,G979>0),\"a c jelű méret legyen 0!\",\" \")","v":" "}]
[null,null,null,null,null,"NF =",2,"db"]
["A hengerelt tartó profil-jelzőszáma: (\"1\" = \"U\", \"2\" = \"I\"):",null,null,null,null,null,1]
["A tartó profilja hengerelt tartó esetén:",null,null,null,null,{"$f":"IF(G964>1,\"I\",\"U\")","v":"U"},140]
["Egy hengerelt tartóprofil inercianyomatéka:",null,null,null,null,"IX =",{"$f":"IF(G961=1,IF(G964>1,VLOOKUP(G965,A1569:I1585,4),VLOOKUP(G965,A1552:I1565,4)),\"egyéb\")","v":6050000},"mm4"]
["Egy hengerelt tartóprofil keresztmetszeti tényezője:",null,null,null,null,"WX =",{"$f":"IF(G961=1,IF(G964>1,VLOOKUP(G965,A1569:I1585,6),VLOOKUP(G965,A1552:I1565,6)),\"egyéb\")","v":86400},"mm3"]
["Egyéb, alkalmazott profil inercianyomatéka:",null,null,null,null,"IX =",null,"mm4"]
["Egyéb, alkalmazott profil keresztmetszeti tényezője:",null,null,null,null,"WX =",null,"mm3"]
["Az aktuális, figyelembe vett inercianyomaték:",null,null,null,null,"IX =",{"$f":"IF(G961>1,G968,G966)","v":6050000},"mm4"]
["Az aktuális, figyelembe vett keresztmetszeti tényező:",null,null,null,null,"WX =",{"$f":"IF(G961>1,G969,G967)","v":86400},"mm3"]
["A közvetlen egymás melletti, együtt dolgozó profilok száma:"]
[null,null,null,null,null,"NT =",2]
["A határfeszültség:",null,null,null,null,"sH =",196,"N/mm2"]
["Dinamikai tényező (\"terhelt\" felsőtartó:\"2\", \"terheletlen\": \"0\"):",null,null,null,null,"KD =",2,"-"]
["Túlterhelési tényező:",null,null,null,null,"KB =",1.4,"-"]
[null,null,null,null,null,"a =",400,"mm"]
[null,null,null,null,null,"b = a =",{"$f":"G977","v":400},"mm"]
[null,null,null,null,null,"c =",0,"mm",{"$f":"IF(AND(G963>1,G979=0),\"nincs szinkronban a tárcsák számával\",\" \")","v":"nincs szinkronban a tárcsák számával"}]
[null,null,null,null,null,null,"L = a + b + c =",{"$f":"IF(OR(ABS(G981-G63)>200,G981<G63),\"Nincs szinkronban BK-val!\",\" \")","v":"Nincs szinkronban BK-val!"}]
[null,null,null,null,null,"=",{"$f":"G977+G978+G979","v":800},"mm"]
[]
[]
[]
[]
[]
[]
[]
[]
[]
[]
[]
[]
["A felső tartó dinamikus terhelése:"]
[null,null,null,null,null,"FMF1 = KD*(KB*GQ + GK + GT + GU + GH) * g /NF =",{"$f":"G975*(G976*G9+G18+G10+G36+G38)*9.81/G963","v":24960.318750000002},"N"]
[null,null,null,{"$f":"IF(G963>1,\" \",\"Csak egy erő van!\")","v":" "},"FMF2 =",{"$f":"IF(G963>1,\"FMF1 =\",\" \")","v":"FMF1 ="},{"$f":"IF(G963>1,G995,0)","v":24960.318750000002},"N"]
["A reakcióerők:",null,null,null,null,"A = [FMF1*(b + c) + FMF2* b] / L =",{"$f":"(G995*(G978+G979)+G996*G978)/G981","v":24960.318749999999},"N"]
[null,null,null,null,null,"B = [FMF1*a + FMF2* (a + c)] / L =",{"$f":"(G995*G977+G996*(G977+G979))/G981","v":24960.318749999999},"N"]
["A hajlító nyomatékok:",null,null,null,null,"M1 = A * a =",{"$f":"G997*G977","v":9984127.5},"Nmm"]
[null,null,null,null,null,"M2 = B * b =",{"$f":"G998*G978","v":9984127.5},"Nmm"]
["Mértékadó nyomaték (a kettő közül a nagyobb):"]
[null,null,null,null,"MM =",{"$f":"IF(G1000>G999,\"M2 = \",\"M1 = \")","v":"M1 = "},{"$f":"IF(G1000>G999,G1000,G999)","v":9984127.5},"Nmm"]
["Maximális hajlítófeszültség:",null,null,null,"s = MM  /(NT * WX) =",{"$f":"G1002/(G973*G971)","v":57.778515624999997},"N/mm2",{"$f":"IF(F1003>G974,\">\",\"<\")","v":"<"},"sH"]
[null,null,null,null,null,null,{"$f":"IF(F1003>G974,\"nem felel meg\",\"megfelel\")","v":"megfelel"}]
["A kéttámaszú tartó lehajlása egy erő hatására, tetszőleges helyen:"]
[null,"f = F * b* (L2*x - b2*x - x3) / 6* I * E * L"]
["A legnagyobb lehajlás helye (ahol e függvény differenciálhányadosának értéke 0):"]
[]
[null,"x =       (L2 - b2) / 3    "]
["A legnagyobb lehajlás helye a FMF1 erő hatására a tartó bal szélétől, a hossz %-ában:"]
[null,null,null,null,{"$f":"IF(G977<G978+G979,\"x/L = 1 - [(L^2 - a^2) / (3* L^2)]^0,5 = \",\"x/L = {[L^2 - (c + b)^2] / (3*L^2]^0,5 = \")","v":"x/L = {[L^2 - (c + b)^2] / (3*L^2]^0,5 = "},{"$f":"IF(G977<G978+G979,1-((G981^2-G977^2)/(3*G981^2))^0.5,((G981^2-(G978+G979)^2)/(3*G981^2))^0.5)","v":0.5},null,{"$f":"F1011*100","v":50},"%"]
["A legnagyobb lehajlás helye a FMF2 erő hatására a tartó bal szélétől, a hossz %-ában:"]
[null,null,null,null,{"$f":"IF(G977+G979<G978,\"x/L = 1 - {[L^2 - (a + c)^2] / (3* L^2)}^0,5 = \",\"x/L =[(L^2 - b^2) / (3*L^2]^0,5 = \")","v":"x/L =[(L^2 - b^2) / (3*L^2]^0,5 = "},{"$f":"IF(G977+G979<G978,1-(((G981^2-(G977+G979)^2))/(3*G981^2))^0.5,((G981^2-G978^2)/(3*G981^2))^0.5)","v":0.5},null,{"$f":"F1013*100","v":50},"%"]
["A legnagyobb lehajlás mindkét erő hatására a tartó középső szakaszán keletkezik."]
["A két dinamikus erő által a tartó közepén okozott lehajlás egyenként:"]
[null,null,null,null,null,{"$f":"IF(G977<G978+G979,\"f1 = FMF1*a*(3/8*L^3 - a^2* L/2) / (6*L*I*E*NT) = \",\"f1 = FMF1*(c+b)*[3/8*L^3 - (c + b)^2 * L/2] / (6*L*I*E*NT) = \")","v":"f1 = FMF1*(c+b)*[3/8*L^3 - (c + b)^2 * L/2] / (6*L*I*E*NT) = "},{"$f":"IF(G977<G978+G979,G995*G977*(3*G981^3/8-G977^2*G981/2)/(6*G981*G970*210000*G973),G995*(G978+G979)*(3*G981^3/8-(G978+G979)^2*G981/2)/(6*G981*G970*210000*G973))","v":0.10477898465171193},"mm"]
[null,null,null,null,null,{"$f":"IF(G977+G979<G978,\"f2 = FMF2*(a + c)*[3/8*L^3 - (a + c)^2* L/2] / 6*L*I*E*NT) = \",\"f2 = FMF2*b*[3/8*L^3 - b^2 * L/2] / (6*L*I*E*NT) = \")","v":"f2 = FMF2*b*[3/8*L^3 - b^2 * L/2] / (6*L*I*E*NT) = "},{"$f":"IF(G977+G979<G978,G996*(G977+G979)*(3*G981^3/8-(G977+G979)^2*G981/2)/(6*G981*G970*210000*G973),G996*G978*(3*G981^3/8-G978^2*G981/2)/(6*G981*G970*210000*G973))","v":0.10477898465171193},"mm"]
["A két  erő hatására együttesen létrejövő lehajlás a tartó közepén (a szuperpozíció elve alapján):"]
[null,null,null,null,null,"f  = f1 + f2 =",{"$f":"G1016+G1017","v":0.20955796930342385},"mm"]
["A tartó statikus lehajlása:",null,null,null,null,"f st = f / KD =",{"$f":"IF(G975=0,G1019,G1019/G975)","v":0.10477898465171193},"mm"]
["A tartó megengedett lehajlása:",null,null," (ha VKN < = 1,0 m/s:  = L/1200, egyébként  = L/2000)"]
[null,null,null,null,"f meg =",{"$f":"IF(G11>1,\"L/2000 =\",\"L/1200 =\")","v":"L/1200 ="},{"$f":"IF(G11>1,G981/2000,G981/1200)","v":0.66666666666666663},"mm"]
[null,"f st",{"$f":"IF(G1020>G1022,\">\",\"< =\")","v":"< ="},"f meg ; ",{"$f":"IF(G1020>G1022,\"a lehajlás nagyobb a megengedettnél\",\"a tartó lehajlás szempontjából megfelel\")","v":"a tartó lehajlás szempontjából megfelel"}]
[]
["Alsó tartó"]
["A tartó profilja (\"1\" = hengerelt profil, \"2\" = egyéb):",null,null,null,null,null,1]
["Az ütközők száma (1 vagy 2):",null,null,null,null,"NP =",2,"db ütköző",{"$f":"IF(AND(G1027=1,G1043>0),\"a c jelű méret legyen 0!\",\" \")","v":" "}]
["A tartó profil jelzőszáma: (\"1\" = \"U\", \"2\" = \"I\"):",null,null,null,null,null,1]
["A tartó profilja:",null,null,null,null,{"$f":"IF(G1028>1,\"I\",\"U\")","v":"U"},140]
["Egy hengerelt tartóprofil inercianyomatéka:",null,null,null,null,"IX =",{"$f":"IF(G1028>1,VLOOKUP(G1029,A1567:I1583,4),VLOOKUP(G1029,A1550:I1563,4))","v":6050000},"mm4"]
["Egy hengerelt tartóprofil keresztmetszeti tényezője:",null,null,null,null,"WX =",{"$f":"IF(G1028>1,VLOOKUP(G1029,A1567:I1583,6),VLOOKUP(G1029,A1550:I1563,6))","v":86400},"mm3"]
["Egy egyéb tartóprofil inercianyomatéka:",null,null,null,null,"IX =",null,"mm4"]
["Egy egyéb tartóprofil keresztmetszeti tényezője:",null,null,null,null,"WX =",null,"mm3"]
["Az aktuális, figyelembe vett inercianyomaték:",null,null,null,null,"IX =",{"$f":"IF(G1026>1,G1032,G1030)","v":6050000},"mm4"]
["Az aktuális, figyelembe vett keresztmetszeti tényező:",null,null,null,null,"WX =",{"$f":"IF(G1026>1,G1033,G1031)","v":86400},"mm3"]
["Az egymás melletti, együtt dolgozó profilok száma:",null,null,null,null,"NT =",2]
["A határfeszültség:",null,null,null,null,"sH =",196,"N/mm2"]
["Dinamikai tényező:",null,{"$f":"D435","v":"Energiatároló ütk."}]
[null,null,null,null,null,"KDP =",{"$f":"G436+0.5","v":3.5},"-"]
["Túlterhelési tényező:",null,null,null,null,"KB =",1.4,"-"]
[null,null,null,null,null,"a =",400,"mm"]
[null,null,null,null,null,"b = a =",{"$f":"G1041","v":400},"mm"]
[null,null,null,null,null,"c =",400,"mm",{"$f":"IF(AND(G1027>1,G1043=0),\"nincs szinkronban az ütközők számával\",\" \")","v":" "}]
[null,null,null,null,null,null,"L = a + b + c =",{"$f":"IF(OR(ABS(G1045-G63)>200,G1045<G63),\"Nincs szinkronban BK-val!\",\" \")","v":"Nincs szinkronban BK-val!"}]
[null,null,null,null,null,"=",{"$f":"G1041+G1042+G1043","v":1200},"mm"]
[]
[]
[]
[]
[]
[]
[]
[]
[]
[]
[]
[]
["Az alsó tartó dinamikus terhelése:"]
[null,null,null,null,null,"FP1 = KD*(KB*GQ + GK) * g * /NP =",{"$f":"G1039*(G1040*G9+G18)*9.81/G1027","v":43519.612500000003},"N"]
[null,null,null,{"$f":"IF(G1027>1,\" \",\"Csak egy erő van!\")","v":" "},"FMF2 =",{"$f":"IF(G1027>1,\"FMF1 =\",\" \")","v":"FMF1 ="},{"$f":"IF(G1027>1,G1059,0)","v":43519.612500000003},"N"]
["A reakcióerők:",null,null,null,null,"A = [FP1*(b + c) + FP2* b] / L =",{"$f":"(G1059*(G1042+G1043)+G1060*G1042)/G1045","v":43519.612500000003},"N"]
[null,null,null,null,null,"B = [FP1*a + FP2* (a + c)] / L =",{"$f":"(G1059*G1041+G1060*(G1041+G1043))/G1045","v":43519.612500000003},"N"]
["A hajlító nyomatékok:",null,null,null,null,"M1 = A * a =",{"$f":"G1061*G1041","v":17407845},"Nmm"]
[null,null,null,null,null,"M2 = B * b =",{"$f":"G1062*G1042","v":17407845},"Nmm"]
["Mértékadó nyomaték (a kettő közül a nagyobb):"]
[null,null,null,null,"MM =",{"$f":"IF(G1064>G1063,\"M2 = \",\"M1 = \")","v":"M1 = "},{"$f":"IF(G1064>G1063,G1064,G1063)","v":17407845},"Nmm"]
["Maximális hajlítófeszültség:",null,null,null,"s = MM  /(NT * WX) =",{"$f":"G1066/(G1036*G1035)","v":100.73984375000001},"N/mm2",{"$f":"IF(F1067>G1037,\">\",\"<\")","v":"<"},"sH"]
[null,null,null,null,null,null,{"$f":"IF(F1067>G1037,\"nem felel meg\",\"megfelel\")","v":"megfelel"}]
["A kéttámaszú tartó lehajlása egy erő hatására, tetszőleges helyen:"]
[null,"f = F * b* (L2*x - b2*x - x3) / 6* I * E * L"]
["A legnagyobb lehajlás helye (ahol e függvény differenciálhányadosának értéke 0):"]
[]
[null,"x =       (L2 - b2) / 3    "]
["A legnagyobb lehajlás helye a FMF1 erő hatására a tartó bal szélétől, a hossz %-ában:"]
[null,null,null,null,{"$f":"IF(G1051<G1042+G1043,\"x/L = 1 - [(L^2 - a^2) / (3* L^2)]^0,5 = \",\"x/L = {[L^2 - (c + b)^2] / (3*L^2]^0,5 = \")","v":"x/L = 1 - [(L^2 - a^2) / (3* L^2)]^0,5 = "},{"$f":"IF(G1041<G1042+G1043,1-((G1045^2-G1041^2)/(3*G1045^2))^0.5,((G1045^2-(G1042+G1043)^2)/(3*G1045^2))^0.5)","v":0.45566894604818264},null,{"$f":"F1075*100","v":45.566894604818266},"%"]
["A legnagyobb lehajlás helye a FMF2 erő hatására a tartó bal szélétől, a hossz %-ában:"]
[null,null,null,null,{"$f":"IF(G1041+G1043<G1042,\"x/L = 1 - {[L^2 - (a + c)^2] / (3* L^2)}^0,5 = \",\"x/L =[(L^2 - b^2) / (3*L^2]^0,5 = \")","v":"x/L =[(L^2 - b^2) / (3*L^2]^0,5 = "},{"$f":"IF(G1041+G1043<G1042,1-(((G1045^2-(G1041+G1043)^2))/(3*G1045^2))^0.5,((G1045^2-G1042^2)/(3*G1045^2))^0.5)","v":0.54433105395181736},null,{"$f":"F1077*100","v":54.433105395181734},"%"]
["A legnagyobb lehajlás mindkét erő hatására a tartó középső szakaszán keletkezik."]
["A két erő által a tartó közepén okozott lehajlás egyenként:"]
[null,null,null,null,null,{"$f":"IF(G1041<G1042+G1043,\"f1 = FP1*a*(3/8*L^3 - a^2* L/2) / 6*L*I*E*NT) = \",\"f1 = FP1*(c+b)*[3/8*L^3 - (c + b)^2 * L/2] / (6*L*I*E*NT) = \")","v":"f1 = FP1*a*(3/8*L^3 - a^2* L/2) / 6*L*I*E*NT) = "},{"$f":"IF(G1041<G1042+G1043,G1059*G1041*(3*G1045^3/8-G1041^2*G1045/2)/(6*G1045*G1034*210000*G1036),G1059*(G1042+G1043)*(3*G1045^3/8-(G1042+G1043)^2*G1045/2)/(6*G1045*G1034*210000*G1036))","v":0.52522685950413228},"mm"]
[null,null,null,null,null,{"$f":"IF(G1041+G1043<G1042,\"f2 = FP2*(a + c)*[3/8*L^3 - (a + c)^2* L/2] / 6*L*I*E*NT) = \",\"f2 = FP2*b*[3/8*L^3 - b^2 * L/2] / (6*L*I*E*NT) = \")","v":"f2 = FP2*b*[3/8*L^3 - b^2 * L/2] / (6*L*I*E*NT) = "},{"$f":"IF(G1041+G1043<G1042,G1060*(G1041+G1043)*(3*G1045^3/8-(G1041+G1043)^2*G1045/2)/(6*G1045*G1034*210000*G1036),G1060*G1042*(3*G1045^3/8-G1042^2*G1045/2)/(6*G1045*G1034*210000*G1036))","v":0.52522685950413228},"mm"]
["A két dinamikus erő hatására együttesen létrejövő lehajlás a tartó közepén (a szuperpozíció elve alapján):"]
[null,null,null,null,null,"f  = f1 + f2 =",{"$f":"G1080+G1081","v":1.0504537190082646},"mm"]
["A statikus deformáció:",null,null,null,null,"f st = f / KDP =",{"$f":"G1083/G1039","v":0.30012963400236131},"mm"]
["A tartó megengedett lehajlása:"]
[" (ha VKN < = 1,0 m/s: f meg = L/1200, egyébként f meg = L/2000)"]
[null,null,null,null,"f meg =",{"$f":"IF(G80>1,\"L/2000 =\",\"L/1200 =\")","v":"L/1200 ="},{"$f":"IF(G80>1,G1045/2000,G1045/1200)","v":1},"mm"]
[null,"f st",{"$f":"IF(G1084>G1087,\">\",\"< =\")","v":"< ="},"f meg ; ",{"$f":"IF(G1084>G1087,\"a lehajlás nagyobb a megengedettnél\",\"a tartó lehajlás szempontjából megfelel\")","v":"a tartó lehajlás szempontjából megfelel"}]
[]
["Függesztőtartó"]
["A tartó profilja (\"1\" = hengerelt \"U\" profil, \"2\" = egyéb):",null,null,null,null,null,1]
["Ha hengerelt \"U\" profil, a szelvény elrendezése (1 vagy 2, az ábra szerint):"]
[null,null,null,null,null,null,2]
[]
[]
[]
[]
[]
[]
[]
[]
[]
[]
["A tartó profil-mérete hengerelt tartó esetén:",null,null,null,null,"U",50]
["Keresztmetszeti tényezői:",null,null,null,null,"Wx-x = ",{"$f":"VLOOKUP(G1104,A1552:I1565,6)","v":10600},"mm3 "]
[null,null,null,null,null,"Wy-y = ",{"$f":"VLOOKUP(G1104,A1552:I1565,7)","v":3750},"mm3"]
["Keresztmetszete:",null,null,null,null,"A = ",{"$f":"VLOOKUP(G1104,A1552:I1565,3)","v":712},"mm2"]
["Egyéb profil alkalmazása esetén az x-koordinátatengellyel párhuzamos "]
[" súlyponti tengelyre vett keresztmetszeti tényezője",null,null,null,null,"WX = ",null,"mm3 "]
["Keresztmetszete:",null,null,null,null,"A = ",null,"mm2"]
["Az aktuális, figyelembe vett keresztmetszeti tényező:",null,null,null,null,"W = ",{"$f":"IF(G1091>1,G1109,IF(G1093>1,G1106,G1105))","v":3750},"mm3 "]
["Az aktuális, figyelembe vett keresztmetszet:",null,null,null,null,"A = ",{"$f":"IF(G1091>1,G1110,G1107)","v":712},"mm2"]
["A párhuzamosan működő profilok száma egy oldalon:",null,null,null,null,"NT = ",2,"-"]
["Túlterhelési tényező:",null,null,null,null,"KB = ",1.4,"-"]
["Dinamikai tényező:",null,null,null,null,"KD = ",{"$f":"IF(G436>G344,G436+0.5,G344+0.5)","v":3.5},"-"]
[null,null,null,null,null,"yQ2 = BK / 8 =",{"$f":"G385","v":162.5},"mm "]
[]
[null,null,null,null,null,"sH =",196,"N/mm2"]
[]
[]
[]
[]
[]
[]
[]
[]
[]
[]
[]
[]
["A vezetőkészülékre ható vízszintes erő:"]
[null,null,null,null,null,"FFy2 = KD * g * [KB*GQ * yQ2 ] / [(ZF/2) * HKF] =",{"$f":"G1115*9.81*G1114*G9*G385/(G278*G296/2)","v":2668.8309374999999},"N"]
["Az egyik oldali függesztőtartó(k)ra ható húzóerő:"]
[null,null,null,null,null,{"$f":"IF(G975=0,\"A felső tartó terheletlen, ezért a függesztőtartóban nem ébred húzóerő\",\"FH = KD*g*[5/8*KB*GQ + (GK+GT+GH+GU)/2] =\")","v":"FH = KD*g*[5/8*KB*GQ + (GK+GT+GH+GU)/2] ="},{"$f":"IF(G975=0,0,G1115*9.81*(5*G1114*G9/8+(G18+G10+G36+G38)/2))","v":49839.3984375},{"$f":"IF(G975=0,\" \",\"N\")","v":"N"}]
["A függesztőtartó mechanikai modellje (az alsó- és felsőtartó, valamint a függesztőtartó"]
["inerciája között nagyságrendi különbséget kihasználva):"]
[]
[]
[]
[]
[]
[]
[]
[]
[]
[]
[]
[]
[]
[]
["A hajlítónyomaték a függesztőtartó végeinél:"]
[null,null,null,null,null,"Mh = FFy2 * HKF /4 =",{"$f":"G1132*G296/4","v":2001623.203125},"Nmm"]
["A függesztőtartó végeinél ébredő feszültség hajlításból:"]
[null,null,null,null,null,"s1 = MM  /(NT * W) =",{"$f":"G1152/(G1113*G1111)","v":266.88309375},"N/mm2"]
["A nagyobb terhelésű tartóban húzásból ébredő feszültség:"]
[null,null,null,null,null,"s2 = FH  /(NT *A) =",{"$f":"G1134/(G1113*G1112)","v":34.999577554424157},"N/mm2"]
["A redukált feszültség:",null,null,null,"s = s1 + s2 =",{"$f":"G1154+G1156","v":301.88267130442415},"N/mm2",{"$f":"IF(F1157>G1118,\">\",\"<\")","v":">"},"sH "]
[null,null,null,null,null,{"$f":"IF(F1157>G1118,\"Nem felel meg!\",\" \")","v":"Nem felel meg!"}]
["Géptartó gerenda (1)"]
["A tartó profil jelzőszáma: (\"1\" = \"U\", \"2\" = \"I\"):",null,null,null,null,null,1]
["A tartó profilja:",null,null,null,null,{"$f":"IF(G1160>1,\"I\",\"U\")","v":"U"},160]
["A közvetlen egymás melletti, együtt dolgozó tartók száma (1 vagy 2):"]
[null,null,null,null,null,"NT =",2]
["Egy tartóprofil inercianyomatéka:",null,null,null,null,"IX =",{"$f":"IF(G1160>1,VLOOKUP(G1161,A1569:I1585,4),VLOOKUP(G1161,A1552:I1565,4))","v":9250000},"mm4"]
["Egy tartóprofil keresztmetszeti tényezője:",null,null,null,null,"WX =",{"$f":"IF(G1160>1,VLOOKUP(G1161,A1569:I1585,6),VLOOKUP(G1161,A1552:I1565,6))","v":116000},"mm3"]
["A határfeszültség:",null,null,null,null,"sH =",196,"N/mm2"]
["Dinamikai tényező:",null,null,null,null,"KD =",2]
[null,null,null,null,null,"a =",700,"mm"]
[null,null,null,null,null,"b =",700,"mm"]
[null,null,null,null,null,"c =",500,"mm"]
[null,null,null,null,null,null,"L = a + b + c ="]
[null,null,null,null,null,"=",{"$f":"G1168+G1169+G1170","v":1900},"mm"]
[null,null,null,null,null,"A géptartó statikus terhelései:"]
[null,null,null,null,null,"FW1 =",9876,"N"]
[null,null,null,null,null,"FW2 =",9876,"N"]
[]
[]
[]
[]
[]
[]
[]
[]
[]
["A reakcióerők:",null,null,null,null,"A = KD* [FW1*(b + c) + FW2* b] / L =",{"$f":"G1167*(G1174*(G1169+G1170)+G1175*G1169)/G1172","v":19752},"N"]
[null,null,null,null,null,"B = KD* [FW1*a + FW2* (a + c)] / L =",{"$f":"G1167*(G1174*G1168+G1175*(G1168+G1170))/G1172","v":19752},"N"]
["A hajlító nyomatékok:",null,null,null,null,"M1 = A * a =",{"$f":"G1185*G1168","v":13826400},"Nmm"]
[null,null,null,null,null,"M2 = B * b =",{"$f":"G1186*G1169","v":13826400},"Nmm"]
["Mértékadó nyomaték (a kettő közül a nagyobb):"]
[null,null,null,null,"MM =",{"$f":"IF(G1188>G1187,\"M2 = \",\"M1 = \")","v":"M1 = "},{"$f":"IF(G1188>G1187,G1188,G1187)","v":13826400},"Nmm"]
["Maximális hajlítófeszültség:",null,null,null,"s = MM  /(NT * WX) =",{"$f":"G1190/(G1163*G1165)","v":59.596551724137932},"N/mm2",{"$f":"IF(F1191>G1166,\">\",\"<\")","v":"<"},"sH"]
[null,null,null,null,null,null,{"$f":"IF(F1191>G1166,\"nem felel meg\",\"megfelel\")","v":"megfelel"}]
["A kéttámaszú tartó lehajlása egy erő hatására, tetszőleges helyen:"]
[null,"f = F * b* (L2*x - b2*x - x3) / 6* I * E * L"]
["A legnagyobb lehajlás helye (ahol e függvény differenciálhányadosának értéke 0):"]
[]
[null,"x =       (L2 - b2) / 3    "]
["A legnagyobb lehajlás helye a FW1 erő hatására a tartó bal szélétől, a hossz %-ában:"]
[null,null,null,null,{"$f":"IF(G1168<G1169+G1170,\"x/L = 1 - [(L^2 - a^2) / (3* L^2)]^0,5 = \",\"x/L = {[L^2 - (c + b)^2] / (3*L^2]^0,5 = \")","v":"x/L = 1 - [(L^2 - a^2) / (3* L^2)]^0,5 = "},{"$f":"IF(G1168<G1169+G1170,1-((G1172^2-G1168^2)/(3*G1172^2))^0.5,((G1172^2-(G1169+G1170)^2)/(3*G1172^2))^0.5)","v":0.46326110383233843},null,{"$f":"F1199*100","v":46.326110383233839},"%"]
["A legnagyobb lehajlás helye a FW2 erő hatására a tartó bal szélétől, a hossz %-ában:"]
[null,null,null,null,{"$f":"IF(G1168+G1170<G1169,\"x/L = 1 - {[L^2 - (a + c)^2] / (3* L^2)}^0,5 = \",\"x/L =[(L^2 - b^2) / (3*L^2]^0,5 = \")","v":"x/L =[(L^2 - b^2) / (3*L^2]^0,5 = "},{"$f":"IF(G1168+G1170<G1169,1-(((G1172^2-(G1168+G1170)^2))/(3*G1172^2))^0.5,((G1172^2-G1169^2)/(3*G1172^2))^0.5)","v":0.53673889616766157},null,{"$f":"F1201*100","v":53.673889616766161},"%"]
["A legnagyobb lehajlás mindkét erő hatására a tartó középső szakaszán keletkezik."]
["A két erő által a tartó közepén okozott lehajlás egyenként:"]
[null,null,null,null,null,{"$f":"IF(G1168<G1169+G1170,\"f1 = FW1*a*(3/8*L^3 - a^2* L/2) / 6*L*I*E*NT) = \",\"f1 = FW1*(c+b)*[3/8*L^3 - (c + b)^2 * L/2] / (6*L*I*E*NT) = \")","v":"f1 = FW1*a*(3/8*L^3 - a^2* L/2) / 6*L*I*E*NT) = "},{"$f":"IF(G1168<G1169+G1170,G1174*G1168*(3*G1172^3/8-G1168^2*G1172/2)/(6*G1172*G1164*210000*G1163),G1174*(G1169+G1170)*(3*G1172^3/8-(G1169+G1170)^2*G1172/2)/(6*G1172*G1164*210000*G1163))","v":0.3288292792792793},"mm"]
[null,null,null,null,null,{"$f":"IF(G1168+G1170<G1169,\"f2 = FW2*(a + c)*[3/8*L^3 - (a + c)^2* L/2] / 6*L*I*E*NT) = \",\"f2 = FW2*b*[3/8*L^3 - b^2 * L/2] / (6*L*I*E*NT) = \")","v":"f2 = FW2*b*[3/8*L^3 - b^2 * L/2] / (6*L*I*E*NT) = "},{"$f":"IF(G1168+G1170<G1169,G1175*(G1168+G1170)*(3*G1172^3/8-(G1168+G1170)^2*G1172/2)/(6*G1172*G1164*210000*G1163),G1175*G1169*(3*G1172^3/8-G1169^2*G1172/2)/(6*G1172*G1164*210000*G1163))","v":0.3288292792792793},"mm"]
["A két erő hatására együttesen létrejövő lehajlás a tartó közepén (a szuperpozíció elve alapján):"]
[null,null,null,null,null,"f  = f1 + f2 =",{"$f":"G1204+G1205","v":0.65765855855855859},"mm"]
["A tartó megengedett lehajlása:",null,null," (ha VKN < = 1,0 m/s:   L/1200, egyébként   L/2000)"]
[null,null,null,null,"f meg =",{"$f":"IF(G11>1,\"L/2000 =\",\"L/1200 =\")","v":"L/1200 ="},{"$f":"IF(G11>1,G1172/2000,G1172/1200)","v":1.5833333333333333},"mm"]
[null,"f",{"$f":"IF(G1207>G1209,\">\",\"< =\")","v":"< ="},"f meg ; ",{"$f":"IF(G1207>G1209,\"a lehajlás nagyobb a megengedettnél\",\"a tartó lehajlás szempontjából megfelel\")","v":"a tartó lehajlás szempontjából megfelel"}]
[]
["Géptartó gerenda (2)"]
["A tartó profil jelzőszáma: (\"1\" = \"U\", \"2\" = \"I\"):",null,null,null,null,null,2]
["A tartó profilja:",null,null,null,null,{"$f":"IF(G1213>1,\"I\",\"U\")","v":"I"},200]
["A közvetlen egymás melletti, együtt dolgozó tartók száma (1 vagy 2):"]
[null,null,null,null,null,"NT =",1]
["Egy tartóprofil inercianyomatéka:",null,null,null,null,"IX =",{"$f":"IF(G1213>1,VLOOKUP(G1214,A1569:I1585,4),VLOOKUP(G1214,A1552:I1565,4))","v":21400000},"mm4"]
["Egy tartóprofil keresztmetszeti tényezője:",null,null,null,null,"WX =",{"$f":"IF(G1213>1,VLOOKUP(G1214,A1569:I1585,6),VLOOKUP(G1214,A1552:I1565,6))","v":214000},"mm3"]
["A határfeszültség:",null,null,null,null,"sH =",196,"N/mm2"]
["Dinamikai tényező:",null,null,null,null,"KD =",2]
[null,null,null,null,null,"a =",1200,"mm"]
[null,null,null,null,null,"b =",1200,"mm"]
[null,null,null,null,null,"c =",500,"mm"]
[null,null,null,null,null,null,"L = a + b + c ="]
[null,null,null,null,null,"=",{"$f":"G1221+G1222+G1223","v":2900},"mm"]
[null,null,null,null,null,"A géptartó statikus terhelései:"]
[null,null,null,null,null,"FW3 =",12650,"N"]
[null,null,null,null,null,"FW4 =",12650,"N"]
[]
[]
[]
[]
[]
[]
[]
[]
[]
["A reakcióerők:",null,null,null,null,"A = KD* [FW3*(b + c) + FW4* b] / L =",{"$f":"G1220*(G1227*(G1222+G1223)+G1228*G1222)/G1225","v":25300},"N"]
[null,null,null,null,null,"B = KD* [FW3*a + FW4* (a + c)] / L =",{"$f":"G1220*(G1227*G1221+G1228*(G1221+G1223))/G1225","v":25300},"N"]
["A hajlító nyomatékok:",null,null,null,null,"M1 = A * a =",{"$f":"G1238*G1221","v":30360000},"Nmm"]
[null,null,null,null,null,"M2 = B * b =",{"$f":"G1239*G1222","v":30360000},"Nmm"]
["Mértékadó nyomaték (a kettő közül a nagyobb):"]
[null,null,null,null,"MM =",{"$f":"IF(G1241>G1240,\"M2 = \",\"M1 = \")","v":"M1 = "},{"$f":"IF(G1241>G1240,G1241,G1240)","v":30360000},"Nmm"]
["Maximális hajlítófeszültség:",null,null,null,"s = MM  /(NT * WX) =",{"$f":"G1243/(G1216*G1218)","v":141.86915887850466},"N/mm2",{"$f":"IF(F1244>G1219,\">\",\"<\")","v":"<"},"sH"]
[null,null,null,null,null,null,{"$f":"IF(F1244>G1219,\"nem felel meg\",\"megfelel\")","v":"megfelel"}]
["A kéttámaszú tartó lehajlása egy erő hatására, tetszőleges helyen:"]
[null,"f = F * b* (L2*x - b2*x - x3) / 6* I * E * L"]
["A legnagyobb lehajlás helye (ahol e függvény differenciálhányadosának értéke 0):"]
[]
[null,"x =       (L2 - b2) / 3    "]
[]
["A legnagyobb lehajlás helye a FW3 erő hatására a tartó bal szélétől, a hossz %-ában:"]
[null,null,null,null,{"$f":"IF(G1221<G1222+G1223,\"x/L = 1 - [(L^2 - a^2) / (3* L^2)]^0,5 = \",\"x/L = {[L^2 - (c + b)^2] / (3*L^2]^0,5 = \")","v":"x/L = 1 - [(L^2 - a^2) / (3* L^2)]^0,5 = "},{"$f":"IF(G1221<G1222+G1223,1-((G1225^2-G1221^2)/(3*G1225^2))^0.5,((G1225^2-(G1222+G1223)^2)/(3*G1225^2))^0.5)","v":0.47439708665868163},null,{"$f":"F1253*100","v":47.43970866586816},"%"]
["A legnagyobb lehajlás helye a FW4 erő hatására a tartó bal szélétől, a hossz %-ában:"]
[null,null,null,null,{"$f":"IF(G1221+G1223<G1222,\"x/L = 1 - {[L^2 - (a + c)^2] / (3* L^2)}^0,5 = \",\"x/L =[(L^2 - b^2) / (3*L^2]^0,5 = \")","v":"x/L =[(L^2 - b^2) / (3*L^2]^0,5 = "},{"$f":"IF(G1221+G1223<G1222,1-(((G1225^2-(G1221+G1223)^2))/(3*G1225^2))^0.5,((G1225^2-G1222^2)/(3*G1225^2))^0.5)","v":0.52560291334131837},null,{"$f":"F1255*100","v":52.56029133413184},"%"]
["A legnagyobb lehajlás mindkét erő hatására a tartó középső szakaszán keletkezik."]
["A két erő által a tartó közepén okozott lehajlás egyenként:"]
[null,null,null,null,null,{"$f":"IF(G1221<G1222+G1223,\"f1 = FW3*a*(3/8*L^3 - a^2* L/2) / 6*L*I*E*NT) = \",\"f1 = FW3*(c+b)*[3/8*L^3 - (c + b)^2 * L/2] / (6*L*I*E*NT) = \")","v":"f1 = FW3*a*(3/8*L^3 - a^2* L/2) / 6*L*I*E*NT) = "},{"$f":"IF(G1221<G1222+G1223,G1227*G1221*(3*G1225^3/8-G1221^2*G1225/2)/(6*G1225*G1217*210000*G1216),G1227*(G1222+G1223)*(3*G1225^3/8-(G1222+G1223)^2*G1225/2)/(6*G1225*G1217*210000*G1216))","v":1.3701351802403203},"mm"]
[null,null,null,null,null,{"$f":"IF(G1221+G1223<G1222,\"f2 = FW4*(a + c)*[3/8*L^3 - (a + c)^2* L/2] / 6*L*I*E*NT) = \",\"f2 = FW4*b*[3/8*L^3 - b^2 * L/2] / (6*L*I*E*NT) = \")","v":"f2 = FW4*b*[3/8*L^3 - b^2 * L/2] / (6*L*I*E*NT) = "},{"$f":"IF(G1221+G1223<G1222,G1228*(G1221+G1223)*(3*G1225^3/8-(G1221+G1223)^2*G1225/2)/(6*G1225*G1217*210000*G1216),G1228*G1222*(3*G1225^3/8-G1222^2*G1225/2)/(6*G1225*G1217*210000*G1216))","v":1.3701351802403203},"mm"]
["A két erő hatására együttesen létrejövő lehajlás a tartó közepén (a szuperpozíció elve alapján):"]
[null,null,null,null,null,"f  = f1 + f2 =",{"$f":"G1258+G1259","v":2.7402703604806407},"mm"]
["A tartó megengedett lehajlása:",null,null," (ha VKN < = 1,0 m/s:  L/1200, egyébként  L/2000)"]
[null,null,null,null,"f meg =",{"$f":"IF(G77>1,\"L/2000 =\",\"L/1200 =\")","v":"L/1200 ="},{"$f":"IF(G77>1,G1225/2000,G1225/1200)","v":2.4166666666666665},"mm"]
[null,"f",{"$f":"IF(G1261>G1263,\">\",\"< =\")","v":">"},"f meg ; ",{"$f":"IF(G1261>G1263,\"a lehajlás nagyobb a megengedettnél\",\"a tartó lehajlás szempontjából megfelel\")","v":"a lehajlás nagyobb a megengedettnél"}]
[]
["Fülke-oldali kötélbekötő gerenda az aknafejben (1)"]
["A tartó profil jelzőszáma: (\"1\" = \"U\", \"2\" = \"I\"):",null,null,null,null,null,1]
["A tartó profilja:",null,null,null,null,{"$f":"IF(G1267>1,\"I\",\"U\")","v":"U"},120]
["Az egymás melletti, együtt dolgozó tartók száma:",null,null,null,null,"NT =",2]
["Egy tartóprofil inercianyomatéka:",null,null,null,null,"IX =",{"$f":"IF(G1267>1,VLOOKUP(G1268,A1569:I1585,4),VLOOKUP(G1268,A1552:I1565,4))","v":3640000},"mm4"]
["Egy tartóprofil keresztmetszeti tényezője:",null,null,null,null,"WX =",{"$f":"IF(G1267>1,VLOOKUP(G1268,A1569:I1585,6),VLOOKUP(G1268,A1552:I1565,6))","v":60700},"mm3"]
["A határfeszültség:",null,null,null,null,"sH =",196,"N/mm2"]
["Dinamikai tényező:",null,null,null,null,"KD =",2]
[null,null,null,null,null,"a =",1200,"mm"]
[null,null,null,null,null,"b =",1200,"mm"]
[null,null,null,null,null,"c =",500,"mm"]
[null,null,null,null,null,null,"L = a + b + c ="]
[null,null,null,null,null,"=",{"$f":"G1274+G1275+G1276","v":2900},"mm"]
[]
[]
[]
[]
[]
[]
[]
[]
[]
[]
[]
[]
["A tartó statikus terhelése a kötélerőből:"]
[null,null,null,null,null,"FK1 = (GQ + GK + GT + GZS + GU + GH) * g  / KZU =",{"$f":"(G9+G18+G10+G33+G36+G38)*9.81/G12","v":10672.843455},"N"]
["Egyéb terhelés:",null,null,null,null,"FK2 =",850,"N"]
["A reakcióerők:",null,null,null,null,"A = KD* [FK1*(b + c) + FK2* b] / L =",{"$f":"G1273*(G1292*(G1275+G1276)+G1293*G1275)/G1278","v":13216.437154137931},"N"]
[null,null,null,null,null,"B = KD* [FK1*a + FK2* (a + c)] / L =",{"$f":"G1273*(G1292*G1274+G1293*(G1274+G1276))/G1278","v":9829.2497558620689},"N"]
["A hajlító nyomatékok:",null,null,null,null,"M1 = A * a =",{"$f":"G1294*G1274","v":15859724.584965518},"Nmm"]
[null,null,null,null,null,"M2 = B * b =",{"$f":"G1295*G1275","v":11795099.707034484},"Nmm"]
["Mértékadó nyomaték (a kettő közül a nagyobb):"]
[null,null,null,null,"MM =",{"$f":"IF(G1297>G1296,\"M2 = \",\"M1 = \")","v":"M1 = "},{"$f":"IF(G1297>G1296,G1297,G1296)","v":15859724.584965518},"Nmm"]
["Maximális hajlítófeszültség:",null,null,null,"s = MM  /(NT * WX) =",{"$f":"G1299/(G1269*G1271)","v":130.64023546100097},"N/mm2",{"$f":"IF(F1300>G1272,\">\",\"<\")","v":"<"},"sH"]
[null,null,null,null,null,null,{"$f":"IF(F1300>G1272,\"nem felel meg\",\"megfelel\")","v":"megfelel"}]
["A kéttámaszú tartó lehajlása egy erő hatására, tetszőleges helyen:"]
[null,"f = F * b* (L2*x - b2*x - x3) / 6* I * E * L"]
["A legnagyobb lehajlás helye (ahol e függvény differenciálhányadosának értéke 0):"]
[]
[null,"x =       (L2 - b2) / 3    "]
[]
["A legnagyobb lehajlás helye a FK1 erő hatására a tartó bal szélétől, a hossz %-ában:"]
[null,null,null,null,{"$f":"IF(G1274<G1275+G1276,\"x/L = 1 - [(L^2 - a^2) / (3* L^2)]^0,5 = \",\"x/L = {[L^2 - (c + b)^2] / (3*L^2]^0,5 = \")","v":"x/L = 1 - [(L^2 - a^2) / (3* L^2)]^0,5 = "},{"$f":"IF(G1274<G1275+G1276,1-((G1278^2-G1274^2)/(3*G1278^2))^0.5,((G1278^2-(G1275+G1276)^2)/(3*G1278^2))^0.5)","v":0.47439708665868163},null,{"$f":"F1309*100","v":47.43970866586816},"%"]
["A legnagyobb lehajlás helye a FK2 erő hatására a tartó bal szélétől, a hossz %-ában:"]
[null,null,null,null,{"$f":"IF(G1274+G1276<G1275,\"x/L = 1 - {[L^2 - (a + c)^2] / (3* L^2)}^0,5 = \",\"x/L =[(L^2 - b^2) / (3*L^2]^0,5 = \")","v":"x/L =[(L^2 - b^2) / (3*L^2]^0,5 = "},{"$f":"IF(G1274+G1276<G1275,1-(((G1278^2-(G1274+G1276)^2))/(3*G1278^2))^0.5,((G1278^2-G1275^2)/(3*G1278^2))^0.5)","v":0.52560291334131837},null,{"$f":"F1311*100","v":52.56029133413184},"%"]
["A legnagyobb lehajlás mindkét erő hatására a tartó középső szakaszán keletkezik."]
["A két erő által a tartó közepén okozott lehajlás egyenként:"]
[null,null,null,null,null,{"$f":"IF(G1274<G1275+G1276,\"f1 = FK1*a*(3/8*L^3 - a^2* L/2) / 6*L*I*E*NT) = \",\"f1 = FK1*(c+b)*[3/8*L^3 - (c + b)^2 * L/2] / (6*L*I*E*NT) = \")","v":"f1 = FK1*a*(3/8*L^3 - a^2* L/2) / 6*L*I*E*NT) = "},{"$f":"IF(G1274<G1275+G1276,G1292*G1274*(3*G1278^3/8-G1274^2*G1278/2)/(6*G1278*G1270*210000*G1269),G1292*(G1275+G1276)*(3*G1278^3/8-(G1275+G1276)^2*G1278/2)/(6*G1278*G1270*210000*G1269))","v":3.3980942907648153},"mm"]
[null,null,null,null,null,{"$f":"IF(G1274+G1276<G1275,\"f2 = FK2*(a + c)*[3/8*L^3 - (a + c)^2* L/2] / 6*L*I*E*NT) = \",\"f2 = FK2*b*[3/8*L^3 - b^2 * L/2] / (6*L*I*E*NT) = \")","v":"f2 = FK2*b*[3/8*L^3 - b^2 * L/2] / (6*L*I*E*NT) = "},{"$f":"IF(G1274+G1276<G1275,G1293*(G1274+G1276)*(3*G1278^3/8-(G1274+G1276)^2*G1278/2)/(6*G1278*G1270*210000*G1269),G1293*G1275*(3*G1278^3/8-G1275^2*G1278/2)/(6*G1278*G1270*210000*G1269))","v":0.27062892464678179},"mm"]
["A két erő hatására együttesen létrejövő lehajlás a tartó közepén (a szuperpozíció elve alapján):"]
[null,null,null,null,null,"f  = f1 + f2 =",{"$f":"G1314+G1315","v":3.668723215411597},"mm"]
["A tartó megengedett lehajlása:",null,null," (ha VKN < = 1,0 m/s:  L/1200, egyébként:  L/2000)"]
[null,null,null,null,"f meg =",{"$f":"IF(G135>1,\"L/2000 =\",\"L/1200 =\")","v":"L/1200 ="},{"$f":"IF(G135>1,G1278/2000,G1278/1200)","v":2.4166666666666665},"mm"]
[null,"f",{"$f":"IF(G1317>G1319,\">\",\"< =\")","v":">"},"f meg ; ",{"$f":"IF(G1317>G1319,\"a lehajlás nagyobb a megengedettnél\",\"a tartó lehajlás szempontjából megfelel\")","v":"a lehajlás nagyobb a megengedettnél"}]
[]
["Ellensúly-oldali kötélbekötő gerenda az aknafejben (2)"]
["A tartó profil jelzőszáma: (\"1\" = \"U\", \"2\" = \"I\"):",null,null,null,null,null,1]
["A tartó profilja:",null,null,null,null,{"$f":"IF(G1323>1,\"I\",\"U\")","v":"U"},120]
["A közvetlen egymás melletti, együtt dolgozó tartók száma (1 vagy 2):"]
[null,null,null,null,null,"NT =",2]
["Egy tartóprofil inercianyomatéka:",null,null,null,null,"IX =",{"$f":"IF(G1323>1,VLOOKUP(G1324,A1569:I1585,4),VLOOKUP(G1324,A1552:I1565,4))","v":3640000},"mm4"]
["Egy tartóprofil keresztmetszeti tényezője:",null,null,null,null,"WX =",{"$f":"IF(G1323>1,VLOOKUP(G1324,A1569:I1585,6),VLOOKUP(G1324,A1552:I1565,6))","v":60700},"mm3"]
["A határfeszültség:",null,null,null,null,"sH =",196,"N/mm2"]
["Dinamikai tényező:",null,null,null,null,"KD =",2]
[null,null,null,null,null,"a =",800,"mm"]
[null,null,null,null,null,"b =",800,"mm"]
[null,null,null,null,null,"c =",500,"mm"]
[null,null,null,null,null,null,"L = a + b + c ="]
[null,null,null,null,null,"=",{"$f":"G1331+G1332+G1333","v":2100},"mm"]
[]
[]
[]
[]
[]
[]
[]
[]
[]
[]
[]
[]
["A tartó statikus terhelése a kötélerőből:"]
[null,null,null,null,null,"FK3 = (GG +  GZS ) * g  / KZU =",{"$f":"(G20+G33)*9.81/G12","v":8113.0465800000011},"N"]
["Egyéb terhelés:",null,null,null,null,"FK4 =",850,"N"]
["A reakcióerők:",null,null,null,null,"A = KD* [FK3*(b + c) + FK4* b] / L =",{"$f":"G1330*(G1349*(G1332+G1333)+G1350*G1332)/G1335","v":10692.343384761905},"N"]
[null,null,null,null,null,"B = KD* [FK3*a + FK4* (a + c)] / L =",{"$f":"G1330*(G1349*G1331+G1350*(G1331+G1333))/G1335","v":7233.7497752380959},"N"]
["A hajlító nyomatékok:",null,null,null,null,"M1 = A * a =",{"$f":"G1351*G1331","v":8553874.7078095246},"Nmm"]
[null,null,null,null,null,"M2 = B * b =",{"$f":"G1352*G1332","v":5786999.8201904772},"Nmm"]
["Mértékadó nyomaték (a kettő közül a nagyobb):"]
[null,null,null,null,"MM =",{"$f":"IF(G1354>G1353,\"M2 = \",\"M1 = \")","v":"M1 = "},{"$f":"IF(G1354>G1353,G1354,G1353)","v":8553874.7078095246},"Nmm"]
["Maximális hajlítófeszültség:",null,null,null,"s = MM  /(NT * WX) =",{"$f":"G1356/(G1326*G1328)","v":70.460252947360175},"N/mm2",{"$f":"IF(F1357>G1329,\">\",\"<\")","v":"<"},"sH"]
[null,null,null,null,null,null,{"$f":"IF(F1357>G1329,\"nem felel meg\",\"megfelel\")","v":"megfelel"}]
["A kéttámaszú tartó lehajlása egy erő hatására, tetszőleges helyen:"]
[null,"f = F * b* (L2*x - b2*x - x3) / 6* I * E * L"]
["A legnagyobb lehajlás helye (ahol e függvény differenciálhányadosának értéke 0):"]
[]
[null,"x =       (L2 - b2) / 3    "]
[]
["A legnagyobb lehajlás helye a FK3 erő hatására a tartó bal szélétől, a hossz %-ában:"]
[null,null,null,null,{"$f":"IF(G1241<G1332+G1333,\"x/L = 1 - [(L^2 - a^2) / (3* L^2)]^0,5 = \",\"x/L = {[L^2 - (c + b)^2] / (3*L^2]^0,5 = \")","v":"x/L = {[L^2 - (c + b)^2] / (3*L^2]^0,5 = "},{"$f":"IF(G1331<G1332+G1333,1-((G1335^2-G1331^2)/(3*G1335^2))^0.5,((G1335^2-(G1332+G1333)^2)/(3*G1335^2))^0.5)","v":0.46618502473650036},null,{"$f":"F1366*100","v":46.61850247365004},"%"]
["A legnagyobb lehajlás helye a FK4 erő hatására a tartó bal szélétől, a hossz %-ában:"]
[null,null,null,null,{"$f":"IF(G1331+G1333<G1332,\"x/L = 1 - {[L^2 - (a + c)^2] / (3* L^2)}^0,5 = \",\"x/L =[(L^2 - b^2) / (3*L^2]^0,5 = \")","v":"x/L =[(L^2 - b^2) / (3*L^2]^0,5 = "},{"$f":"IF(G1331+G1333<G1332,1-(((G1335^2-(G1331+G1333)^2))/(3*G1335^2))^0.5,((G1335^2-G1332^2)/(3*G1335^2))^0.5)","v":0.53381497526349964},null,{"$f":"F1368*100","v":53.38149752634996},"%"]
["A legnagyobb lehajlás mindkét erő hatására a tartó középső szakaszán keletkezik."]
["A két erő által a tartó közepén okozott lehajlás egyenként:"]
[null,null,null,null,null,{"$f":"IF(G1331<G1332+G1333,\"f1 = FK3*a*(3/8*L^3 - a^2* L/2) / 6*L*I*E*NT) = \",\"f1 = FK3*(c+b)*[3/8*L^3 - (c + b)^2 * L/2] / (6*L*I*E*NT) = \")","v":"f1 = FK3*a*(3/8*L^3 - a^2* L/2) / 6*L*I*E*NT) = "},{"$f":"IF(G1331<G1332+G1333,G1349*G1331*(3*G1335^3/8-G1331^2*G1335/2)/(6*G1335*G1327*210000*G1326),G1349*(G1332+G1333)*(3*G1335^3/8-(G1332+G1333)^2*G1335/2)/(6*G1335*G1327*210000*G1326))","v":0.94372718263343802},"mm"]
[null,null,null,null,null,{"$f":"IF(G1331+G1333<G1332,\"f2 = FK4*(a + c)*[3/8*L^3 - (a + c)^2* L/2] / 6*L*I*E*NT) = \",\"f2 = FK4*b*[3/8*L^3 - b^2 * L/2] / (6*L*I*E*NT) = \")","v":"f2 = FK4*b*[3/8*L^3 - b^2 * L/2] / (6*L*I*E*NT) = "},{"$f":"IF(G1331+G1333<G1332,G1350*(G1331+G1333)*(3*G1335^3/8-(G1331+G1333)^2*G1335/2)/(6*G1335*G1327*210000*G1326),G1350*G1332*(3*G1335^3/8-G1332^2*G1335/2)/(6*G1335*G1327*210000*G1326))","v":9.8873844409558695E-2},"mm"]
["A két erő hatására együttesen létrejövő lehajlás a tartó közepén (a szuperpozíció elve alapján):"]
[null,null,null,null,null,"f  = f1 + f2 =",{"$f":"G1371+G1372","v":1.0426010270429966},"mm"]
["A tartó megengedett lehajlása:",null,null," (ha VKN < = 1,0 m/s:  L/1200, egyébként:  L/2000)"]
[null,null,null,null,"f meg =",{"$f":"IF(G195>1,\"L/2000 =\",\"L/1200 =\")","v":"L/1200 ="},{"$f":"IF(G195>1,G1335/2000,G1335/1200)","v":1.75},"mm"]
[null,"f",{"$f":"IF(G1374>G1376,\">\",\"< =\")","v":"< ="},"f meg ; ",{"$f":"IF(G1374>G1376,\"a lehajlás nagyobb a megengedettnél\",\"a tartó lehajlás szempontjából megfelel\")","v":"a tartó lehajlás szempontjából megfelel"}]
[]
[]
["Gépbeemelő-tartó"]
[null,null,null,null,null,"A hengerelt tartó profilja: (\"1\" = \"U\", \"2\" = \"I\"):",2]
[null,null,null,null,null,{"$f":"IF(G1381>1,\"I\",\"U\")","v":"I"},160]
[]
[null,null,null,null,null,"WX =",{"$f":"IF(G1381>1,VLOOKUP(G1382,A1569:I1585,6),VLOOKUP(G1382,A1552:I1565,6))","v":117000},"mm3"]
[null,null,null,null,null,"sH =",196,"N/mm2"]
[null,null,null,null,null,"kd=",2]
[null,null,null,null,null,"a =",1600,"mm"]
[null,null,null,null,null,"k =",0,"mm"]
[null,null,null,null,null,"T =",10000,"N"]
[null,null,null,null,null,"KD =",2]
["A max. reakcióerők:",null,null,null,null,"A = B = T * (a + k) / a =",{"$f":"G1389*(G1387+G1388)/G1387","v":10000},"N"]
["A hajlító nyomatékok:",null,null,null,null,"M1 = KD * T * a / 4 =",{"$f":"G1390*G1389*G1387/4","v":8000000},"Nmm"]
[null,null,null,null,null,"M2 = KD * T *k =",{"$f":"G1390*G1389*G1388","v":0},"Nmm"]
["Mértékadó nyomaték (a kettő közül a nagyobb):"]
[null,null,null,null,"MM =",{"$f":"IF(G1393>G1392,\"M2 = \",\"M1 = \")","v":"M1 = "},{"$f":"IF(G1393>G1392,G1393,G1392)","v":8000000},"Nmm"]
["Maximális hajlítófeszültség:",null,null,null,"s = MM  /WX =",{"$f":"G1395/G1384","v":68.376068376068375},"N/mm2",{"$f":"IF(F1396<G1385,\"<\",\">\")","v":"<"},"sH"]
[null,null,null,null,null,null,{"$f":"IF(F1396<G1385,\"megfelel\",\"nem felel meg\")","v":"megfelel"}]
[]
["Az épületre átadódó terhelések EN 81 szerint"]
["E számítások során figyelembe vett nehézségi gyorsulás értéke:"]
[null,null,null,null,{"$f":"IF(G1401=9.81,\" \",\"Kerekítve:\")","v":"Kerekítve:"},"g =",10,"m/s2"]
["A hajtóműtől és önsúlyból származó terhelés a fülkei vezetősín alatt, egy sínre:"]
["(ha a hajtómű nem terheli a sínt: KDM = 0      ha terheli: KDM = 2)"]
[null,null,null,null,null,"KDM =",1.2,"KB = ",1.4]
[null,null,null,null,null,null,null,null,"F1W = (KDM*(KB*GQ+GK+GT+GG+GZS+GU+GH)+(GW+GWR+GD)*KDM/2)/ZF+GF)*g/1000 ="]
[null,null,null,null,null,null,null,{"$f":"((G1404*(I1404*G9+G18+G10+G20+G33+G36+G38)+(G21+G22+G23)*G1404/2)/2+G289)*G1401/1000","v":29.856566000000001},"kN"]
["Terhelés a fülkei vezetősínek alatt a fogókészülék működéséből, egy sínre:"]
[null,null,null,null,null,null,"F1S = (KDS*(GQ+GK+GU+GH)/ZF+GF)*g =",{"$f":"(G344*(G9+G18+G36+G38)/G278+G289)*G1401/1000","v":35.577725000000001},"kN"]
["Mértékadó terhelés a fülkei vezetősínek alatt (egy sínre, a fentiek közül a nagyobb):"]
[null,null,null,null,null,"F1 =",{"$f":"IF(H1408>H1406,\"F1S =\",\"F1W =\")","v":"F1S ="},{"$f":"IF(H1408>H1406,H1408,H1406)","v":35.577725000000001},"kN"]
["Mértékadó terhelés az ellensúly vezetősínek alatt:"]
[null,null,null,null,null,null,"F2 = (KDS*(GG+GU+GH)/ZF+GF)*g =",{"$f":"(G656*(G20+G36+G38)/G574+G585)*G1401/1000","v":1.7173699999999998},"kN"]
["Mértékadó terhelés a fülkei ütközők alatt:"]
["(egy ütközőre, az EN81-1:2002 5.3.2.2 szakasza szerint):"]
[null,null,null,null,null,"Az ütközők száma: ZPK =",2,"db"]
[null,null,null,null,null,null,"F3 = 4 * (GQ + GK)  *g / 1000 * ZPK =",{"$f":"4*(G9+G18)*G1401/(1000*G1415)","v":42.5},"kN"]
["Mértékadó terhelés az ellensúly ütközői alatt:"]
["(egy ütközőre, az EN81-1:2002 5.3.2.3 szakasza szerint):"]
[null,null,null,null,null,"Az ütközők száma: ZPG =",2,"db"]
[null,null,null,null,null,null,"F4 = 4 * GG  *g / 1000 * ZPG =",{"$f":"4*G20*G1401/(1000*G1419)","v":32.25},"kN"]
["Mértékadó vízszintes, tűméret-irányú terhelés a fülkei vezetősín-gyámra:"]
["A korábban kiszámított, sínre ható FFy erők közül a legnagyobb:"]
[null,null,null,null,null,null,"F5 =",{"$f":"G1450/1000","v":1.6339781250000001},"kN"]
["Mértékadó vízszintes, tűméret síkjára merőleges terhelés a fülkei vezetősín-gyámra:"]
["A korábban kiszámított, sínre ható, FFx erők közül a legnagyobb:"]
[null,null,null,null,null,null,"F6 =",{"$f":"D1453/1000","v":1.57036640625},"kN"]
[]
["Terhelések kN-ban:"]
["Megnevezés",null,null,null,"Jel","Mért. terh.","Alapterhelések"]
[null,null,null,null,null,null,"Álló töm.","Mozgó töm.","Haszn. terh."]
["Fülkei sín alatt, egy sínre",null,null,null,"F1",{"$f":"H1410","v":35.577725000000001},{"$f":"IF(H1408>H1406,G289*G1401/1000,(G289+(G21+G22+G23)/G278))*G1401/1000","v":3.5620999999999993E-2},{"$f":"IF(H1408>H1406,(G18+G36+G38)*G1401/1000,(G9+G18+G20+G33+G36+G38)*G1401/1000)","v":11.09375},{"$f":"G9*G1401/1000","v":10.25}]
["Ellensúly-sín alatt, egy sínre",null,null,null,"F2",{"$f":"H1412","v":1.7173699999999998},{"$f":"G585*G1401/1000","v":1.7173699999999998},{"$f":"(G20+G36+G38)*G1401/1000","v":16.21875},"-"]
["Fülkei ütköző alatt, egy ütközőre",null,null,null,"F3",{"$f":"H1416","v":42.5},"-",{"$f":"G18*G1401/1000","v":11},{"$f":"G9*G1401/1000","v":10.25}]
["Ellensúly-ütköző alatt, egy ütközőre",null,null,null,"F4",{"$f":"H1420","v":32.25},"-",{"$f":"G20*G1401/1000","v":16.125},"-"]
["Fülke-sín vízsz. tűm.-irány",null,null,null,"F5",{"$f":"H1423","v":1.6339781250000001},"-","-",{"$f":"G9*G1401/1000","v":10.25}]
["Fülke-sín tűm.-re merőleges irány",null,null,null,"F6",{"$f":"H1426","v":1.57036640625},"-",{"$f":"(G18+G36+G38)*G1401/1000","v":11.09375},{"$f":"G9*G1401/1000","v":10.25}]
[]
[]
[]
[]
[]
[]
["Ezt már nem kell kinyomtatni!"]
[{"$f":"SIGN(G356)","v":-1},{"$f":"IF(A1444=0,1,A1444)","v":-1},null,null,"<","Ne töröld ki ezeket !",null,">"]
[]
[null,null,"Sínerők FFx","Legnagyobb:",null,"Sínerők FFy","Legnagyobb:"]
[null,null,{"$f":"H368","v":1466.9015625},null,null,{"$f":"H403","v":1633.9781250000001}]
[null,null,{"$f":"H399","v":209.99531250000001},{"$f":"IF(C1448>C1447,C1448,C1447)","v":1466.9015625},null,{"$f":"H453","v":1633.9781250000001},{"$f":"IF(F1448>F1447,F1448,F1447)","v":1633.9781250000001}]
[null,null,{"$f":"H441","v":1466.9015625},{"$f":"IF(C1449>D1448,C1449,D1448)","v":1466.9015625},null,{"$f":"H493","v":653.59124999999995},{"$f":"IF(F1449>G1448,F1449,G1448)","v":1633.9781250000001}]
[null,null,{"$f":"H449","v":1570.36640625},{"$f":"IF(C1450>D1449,C1450,D1449)","v":1570.36640625},null,{"$f":"H553","v":100.55249999999999},{"$f":"IF(F1450>G1449,F1450,G1449)","v":1633.9781250000001}]
[null,null,{"$f":"H476","v":151.44187500000001},{"$f":"IF(C1451>D1450,C1451,D1450)","v":1570.36640625}]
[null,null,{"$f":"H489","v":628.14656249999996},{"$f":"IF(C1452>D1451,C1452,D1451)","v":1570.36640625}]
[null,null,{"$f":"H549","v":1415.6034374999999},{"$f":"IF(C1453>D1452,C1453,D1452)","v":1570.36640625}]
[]
["Sínprofilok:"]
["ssz.","ISO-kód","méret",null,"AF","IFX","IFY","WFX","WFY"]
[1,"T 45/A","45x45x5",null,425,80800,38400,2530,1710]
[2,"T 50/A","50x50x5",null,475,112400,52500,3150,2100]
[3,"T 70-2/A","70x70x8",null,1052,474300,221300,9630,6610]
[4,"T 70-1/A","70x65x9",null,951,413000,186500,9240,5350]
[5,"T 75-3/A","75x62x10",null,1099,403500,264900,9290,7060]
[6,"T 75-3/B","75x62x10",null,1099,403500,264900,9290,7060]
[7,"T 82/A","82,5x68,25x9",null,1090,494000,305000,10200,7400]
[8,"T 89/A","89x62x15,88",null,1570,595200,524000,14250,11800]
[9,"T 89/B","89x62x15,88",null,1570,595200,524000,14250,11800]
[10,"T 90/A","90x75x16",null,1725,1020000,526000,20870,11800]
[11,"T 90/B","90x75x16",null,1725,1020000,526000,20870,11800]
[12,"T 125/B","125x82x16",null,2283,1510000,1590000,26200,25400]
[13,"T 127-1/B","127x89x15,88",null,2264,1862000,1480000,30400,23400]
[14,"T 127-2/B","127x89x15,89",null,2863,1984000,2300000,30900,36200]
[15,"T 140-1/B","140x108x19",null,3520,4040000,3100000,53400,44300]
[16,"( V0 ) (A)","50x50x6",null,568,121000,60600,3360,2420]
[17,"( V1 ) (B)","60x50x10",null,760,191000,93000,5800,3100]
[18,"( V2 ) (B)","90x65x12",null,1420,534000,511000,11700,11300]
[19,"( V3 ) (B)","125x90x16",null,2490,1948000,1512000,31000,24200]
[20,"( V4 ) (B)","150x110x25",null,4175,5120000,3380000,71500,45000]
[]
[]
["ssz.","ISO-kód","ix","iy","CF","GFM","RM","Anyag"]
[1,"T 45/A",13.8,9.5,5,3.34,370,"ST-37"]
[2,"T 50/A",15.4,10.5,5,3.73,370,"ST-37"]
[3,"T 70-2/A",21.2,14.8,8,8.26,370,"ST-37"]
[4,"T 70-1/A",20.9,14,6,7.47,370,"ST-37"]
[5,"T 75-3/A",19.2,15.5,8,8.6300000000000008,370,"ST-37"]
[6,"T 75-3/B",19.2,15.5,8,8.6300000000000008,440,"ST-44"]
[7,"T 82/A",21.3,16.7,7.5,8.5500000000000007,370,"ST-37"]
[8,"T 89/A",19.5,18.3,10,12.3,370,"ST-37"]
[9,"T 89/B",19.5,18.3,10,12.3,440,"ST-44"]
[10,"T 90/A",24.3,17.5,10,13.55,370,"ST-37"]
[11,"T 90/B",24.3,17.5,10,13.55,440,"ST-44"]
[12,"T 125/B",25.7,26.4,10,17.899999999999999,440,"ST-44"]
[13,"T 127-1/B",28.7,25.6,10,17.77,440,"ST-44"]
[14,"T 127-2/B",26.3,28.3,10,22.48,440,"ST-44"]
[15,"T 140-1/B",33.9,29.7,12.7,27.6,440,"ST-44"]
[16,"( V0 ) (A)",10.4,10.3,6,4.4400000000000004,380,"A38"]
[17,"( V1 ) (B)",11.2,11.1,7,5.96,380,"A38"]
[18,"( V2 ) (B)",18.899999999999999,18.8,9,11.2,380,"A38"]
[19,"( V3 ) (B)",24.7,24.6,11,19.7,380,"A38"]
[20,"( V4 ) (B)",28.3,28.2,16,32.799999999999997,380,"A38"]
[]
[]
["FDR számítása"]
[null,"terelés"]
[0,"nincs",null,null,null,null,"FDR = [(GK + GQ + GT + GG + GZS + GH + GU) / KZU+ GD]*g =",{"$f":"((G9+G10+G18+G20+G33+G38+G36)/G12+G23)*9.81","v":19151.135955000002}]
[1,"ellensúly terelve (\"fülke-hajtás\")",null,null,null,null,"FDR = {[(GK+GQ+GT+GH+GU)/KZU+GD]^2+[(GG+GZS)/KZU]^2-2*[(GK+GQ+GT+GH+GU)/KZU+GD]*[(GG+GZS)/KZU]*cos(beta)}^0,5*g =",{"$f":"(((G9+G10+G18+G38+G36)/G12+G23)^2+((G20+G33)/G12)^2-2*((G9+G10+G18+G38+G36)/G12+G23)*((G20+G33)/G12)*COS(E60))^0.5*9.81","v":19004.105547223207}]
[2,"fülke terelve (\"ellensúly-hajtás\")",null,null,null,null,"FDR = {[(GK+GQ+GT+GH+GU)/KZU]^2+[(GG+GZS)/KZU+GD]^2-2*[(GK+GQ+GT+GH+GU)/KZU]*[(GG+GZS)/KZU+GD]*cos(beta)}^0,5*g =",{"$f":"(((G9+G10+G18+G38+G36)/G12)^2+((G20+G33)/G12+G23)^2-2*((G9+G10+G18+G38+G36)/G12)*((G20+G33)/G12+G23)*COS(E60))^0.5*9.81","v":19001.895939526195}]
[]
["FRR számítása"]
[null,"terelés"]
[0,"nincs",null,null,null,null,"FRR =",0]
[1,"ellensúly terelve (\"fülke-hajtás\")",null,null,null,null,"FRR = {[(GG+GZS)/KZU+GR]^2+[(GG+GZS)/KZU]^2-2*[(GG+GZS)/KZU+GR]*[(GG+GZS)/KZU]*cos(pi-beta)}^0,5*g =",{"$f":"(((G20+G33)/G12+G49)^2+((G20+G33)/G12)^2-2*((G20+G33)/G12+G49)*((G20+G33)/G12)*COS(PI()-E60))^0.5*9.81","v":2128.1566664442289}]
[2,"fülke terelve (\"ellensúly-hajtás\")",null,null,null,null,"FRR = {[(GK+GQ+GT+GH+GU)/KZU]^2+[(GK+GQ+GT+GH+GU)/KZU+GR]^2-2*[(GK+GQ+GT+GH+GU)/KZU]*[(GK+GQ+GT+GH+GU)/KZU+GR]*cos(pi - beta)}^0,5*g =",{"$f":"(((G9+G10+G18+G38+G36)/G12)^2+((G9+G10+G18+G38+G36)/G12+G49)^2-2*((G9+G10+G18+G38+G36)/G12)*((G9+G10+G18+G38+G36)/G12+G49)*COS(PI()-E60))^0.5*9.81","v":2708.3913430660309}]
[]
[]
[]
[]
[]
[]
[]
[]
[]
[]
[]
[]
[]
[]
[]
[]
[]
[]
[]
[]
[]
[]
[]
[]
[]
[]
[]
[]
[]
[]
[]
[]
[]
[]
[]
[]
[]
["Hengerelt \"U\"-acélok (MSZ 326)"]
["U","b [mm]","A [mm2]","IX [mm4]","IY [mm4]","WX [mm3]","WY [mm3]","iy [mm]","kg/m"]
[50,38,712,264000,91200,10600,3750,11.3,5.59]
[65,42,903,575000,141000,17700,5070,12.5,7.09]
[80,45,1100,1060000,194000,26500,6360,13.3,8.64]
[100,50,1350,2060000,293000,41200,8490,14.7,10.6]
[120,55,1700,3640000,432000,60700,11100,15.9,13.4]
[140,60,2040,6050000,627000,86400,14800,17.5,16]
[160,65,2400,9250000,853000,116000,18300,18.899999999999999,18.8]
[180,70,2800,13500000,1140000,150000,22400,20.2,22]
[200,75,3220,19100000,1480000,191000,27000,21.4,25.3]
[220,80,3740,26900000,1970000,245000,33600,23,29.4]
[240,85,4230,36000000,2480000,300000,39600,24.2,33.200000000000003]
[260,90,4830,48200000,3170000,371000,47700,25.6,37.9]
[280,95,5330,62800000,3990000,448000,57200,27.4,41.8]
[300,100,5880,80300000,4950000,535000,67800,29,46.2]
[]
["Hengerelt \"I\"-acélok (MSZ 532)"]
["I","b [mm]","A [mm2]","IX [mm4]","IY [mm4]","WX [mm3]","WY [mm3]","iy [mm]","kg/m"]
[80,42,757,778000,62900,19500,3000,9.1,5.94]
[100,50,1060,1710000,122000,34200,4880,10.7,8.34]
[120,58,1420,3280000,215000,54700,7410,12.3,11.1]
[140,66,1820,5730000,352000,81900,10700,14,14.3]
[160,74,2280,9350000,547000,117000,14800,15.5,17.899999999999999]
[180,82,2790,14500000,813000,161000,19800,17.100000000000001,21.9]
[200,90,3340,21400000,1170000,214000,26000,18.7,26.2]
[220,98,3950,30600000,1620000,278000,33100,20.2,31.1]
[240,106,4610,42500000,2210000,354000,41700,22,36.200000000000003]
[260,113,5330,57400000,2880000,442000,51000,23.2,41.9]
[280,119,6100,75900000,3640000,542000,61200,24.5,47.9]
[300,125,6900,98000000,4510000,653000,72200,25.6,54.2]
[320,131,7770,125100000,5550000,782000,84700,26.7,61]
[340,137,8670,157000000,6740000,923000,98400,28,68]
[360,143,9700,196100000,8180000,1090000,114000,29,76.099999999999994]
[380,149,10700,240100000,9750000,1260000,131000,30.2,84]
[400,155,11800,292100000,11600000,1460000,149000,31.3,92.4]
[]
[]
["1.1. táblázat",null,null,null,null,"1.1.A táblázat"]
["Névl. teherbírás",null,"Fülke max. alapterülete",null,null,"Névl. teherbírás","Fülke max. alapterülete"]
[null,null,null,null,"AA / A"]
[100,1,0.37,1,null,100,0.37]
[180,2,0.57999999999999996,2,null,180,0.57999999999999996]
[225,3,0.7,3,null,225,0.7]
[300,4,0.9,4,null,300,0.9]
[375,5,1.1000000000000001,5,null,375,1.1000000000000001]
[400,6,1.17,6,{"$f":"G1596/C1596","v":1.4358974358974359},400,1.68]
[450,7,1.3,7,1.4153846153846155,450,1.84]
[525,8,1.45,8,1.4344827586206899,525,2.08]
[600,9,1.6,9,1.4499999999999997,600,2.3199999999999998]
[630,10,1.66,10,1.4578313253012047,630,2.42]
[675,11,1.75,11,1.4628571428571429,675,2.56]
[750,12,1.9,12,1.4736842105263157,750,2.8]
[800,13,2,13,1.48,800,2.96]
[825,14,2.0499999999999998,14,1.4829268292682929,825,3.04]
[900,15,2.2000000000000002,15,1.4909090909090907,900,3.28]
[975,16,2.35,16,1.4978723404255319,925,3.52]
[1000,17,2.4,17,1.5,1000,3.6]
[1050,18,2.5,18,1.488,1050,3.72]
[1125,19,2.65,19,1.4716981132075473,1125,3.9]
[1200,20,2.8,20,1.4571428571428573,1200,4.08]
[1250,21,2.9,21,1.4482758620689655,1250,4.2]
[1275,22,2.95,22,1.4440677966101694,1275,4.26]
[1350,23,3.1,23,1.4322580645161291,1350,4.4400000000000004]
[1425,24,3.25,24,1.4215384615384616,1425,4.62]
[1500,25,3.4,25,1.411764705882353,1500,4.8,null,{"$f":"VLOOKUP(G9,A1591:G1618,2)","v":17}]
[1600,26,3.56,26,1.4157303370786516,1600,5.04,null,{"$f":"VLOOKUP(G9,C1591:D1618,2)","v":28}]
[2000,27,4.2,27,null,2000]
[2500,28,5,28,null,2500]
[null,29,5.0999999999999996,29,null,2501]
[]
["GQ1 =",{"$f":"VLOOKUP(G9,A1591:G1618,1)","v":1000},"A1 =",{"$f":"VLOOKUP(G9,A1591:G1618,3)","v":2.4}]
["GQ2 =",{"$f":"VLOOKUP(I1615+1,B1591:G1619,5)","v":1050},"A2 =",{"$f":"VLOOKUP(I1615+1,B1591:G1619,2)","v":2.5}]
[]
["GQ1 =",{"$f":"VLOOKUP(G9,A1591:G1618,1)","v":1000},"A1 =",{"$f":"VLOOKUP(G9,A1591:G1618,7)","v":3.6}]
["GQ2 =",{"$f":"VLOOKUP(I1615+1,B1591:G1619,5)","v":1050},"A2 =",{"$f":"VLOOKUP(I1615+1,B1591:G1618,6)","v":3.72}]
[]
["Interpoláció az 1.1 táblázat szerint:"]
[null,null,null,null,null,"Amax = A1 + (GQ - GQ1) * (A2 - A1) / (GQ2 - GQ1) =",{"$f":"D1621+(G9-B1621)*(D1622-D1621)/(B1622-B1621)","v":2.4500000000000002},"m2"]
["Interpoláció az 1.1.A táblázat szerint:"]
[null,null,null,null,null,"Amax = A1 + (GQ - GQ1) * (A2 - A1) / (GQ2 - GQ1) =",{"$f":"D1624+(G9-B1624)*(D1625-D1624)/(B1625-B1624)","v":3.66},"m2"]
["Ha GQ > 2500 kg-nál, számítással:"]
[null,null,null,null,null,"A = 5 + (GQ - 2500) * 0,16 /100 =",{"$f":"5+(G9-2500)*0.16/100","v":2.64},"m2"]
[]
[]
[]
["Emlékeztető: Kéttámaszú tartó lehajlása:"]
[]
[]
[]
[]
[]
[]
[]
[]
[]
[]
[]
[]
[]
[]
[]
[]
[]
[]
[]
["A kéttámaszú tartó lehajlása egy erő hatására"]
["(a meggörbült tartó rugalmas szálának egyenlete),"]
["az (x = < a) szakaszon, ezen belül tetszőleges helyen:"]
[null,null,"y (x)  = F  b (L2x - b2x - x3) / 6* I  E L"]
["A legnagyobb lehajlás helye (ahol e függvény differenciálhányadosának értéke 0):"]
[]
[null,null,"xm =       (L2-b2)/3    ",null,"ha b < = L/2"]
["Ennek szélső értéke, azaz, ha az erő helye a tartó vége felé közelít, azaz szélső "]
["esetben: xm = 0,577 * L . Ebből az következik, hogy a legnagyobb lehajlás helye"]
["az erő bármelyik helyzetében a tartó közepén, a tartó hosszának 42 és 58 %-a "]
["között van."]
[]
["max. lassulás"]
[0,"nem rövidített ütköző",null,0.5,"A lassulás legalább 0,5 m/s!"]
[1,"rövidített üzközőlöket",null,0.8,"A lassulás legalább 0,8 m/s!"]

{"sheet":"kötél","index":7,"n_rows":24,"n_cols":13,"rows_kept":24,"cut":false,"hidden":false,"merged":[]}
["kötélazonositó","kötélszerkezet","sodrastipus","kötélátméro","pasznaszam","kötélszakitószilárdság","sodrsirany","betetfajta","meret","feluletkezeles","számitottszakitóero","minimálisszakitoero","kötélfmsúly"]
[20,"NINCS","",0,"",0,"","","","",0,0,0]
[21,"Acélbetétes gumi v. poliuretán_SMT-PV30","",1.73,"",1770,"","",12,"",0,42,0.25]
[17,"Acélbetétes gumi v. poliuretán_SMT-PV40","","1.73x16","",1770,"","",16,"",0,56,0.33]
[22,"Acélbetétes gumi v. poliuretán_ SMT-PV50","","1.73x20","",1770,"","",20,"",0,70,0.42]
[23,"Acélbetétes gumi v. poliuretán_SMT-PV60","","1.73x24","",0,"","",24,"",0,84,0.5]
[4,"Seale","+",6,"H",1570,"J","K","6x19","-",21.7,18.899999999999999,0.13]
[14,"Seale","+",6.5,"B",1770,"J","F","6x19","-",26.7,23.5,0.154]
[19,"PAWO","",6.5,"",0,"","","","",31.5,23.5,0.17]
[15,"DRAKO 250T","+",8,"",1570,"J","F","8x19","-",49.4,38.799999999999997,0.27]
[1,"Seale","+",8,"B",1770,"J","K","8x19","ZN",35.299999999999997,30.4,0.22]
[5,"Seale","+",8,"B",1570,"J","F","8x19","-",33,28.21,0.22]
[6,"Seale","+",9,"B",1570,"J","F","8x19","-",43.4,37.299999999999997,0.28999999999999998]
[18,"DRAKO 250T","+",10,"",1570,"J","F","8x19","-",60.6,52.845999999999997,0.42]
[2,"Seale","+",10,"B",1570,"J","F","8x19","-",55.1,52.845999999999997,0.36]
[16,"DRAKO 250T","+",11,"B",1570,"J","K","8x19","-",95.7,75.099999999999994,0.51200000000000001]
[3,"Seale","+",11,"B",1570,"J","F","8x19","-",66.7,57.4,0.40699999999999997]
[13,"Saele","+",12,"B",1570,"J","F","8x19","-",79.5,68.400000000000006,0.48499999999999999]
[7,"Seale","+",13,"B",1570,"J","F","8x19","-",93.1,80,0.56899999999999995]
[8,"Seale","+",15,"B",1570,"J","F","8x19","-",121,104,0.78]
[9,"Seale","+",15.5,"B",1570,"J","F","8x19","-",129,111,0.81]
[10,"Seale","+",16,"B",1570,"J","F","8x19","-",131.5,113,0.88]
[11,"Seale","+",17,"B",1570,"J","F","8x19","-",154.5,133,0.98]
[12,"Seale","+",19,"B",1570,"J","F","8x19","-",0,159,1.24]

{"sheet":"TeherbÍrás","index":8,"n_rows":63,"n_cols":3,"rows_kept":63,"cut":false,"hidden":false,"merged":[]}
["teherbirás","személyekszáma","felvonotipus"]
[1350,0,"17,22,126,"]
[100,0,"17,22,28,29,"]
[225,3,"28,47,55,"]
[230,0,"92,"]
[250,0,"4,17,22,28,"]
[300,4,"4,17,22,28,35,55,92,51,"]
[320,4,"10,22,28,29,37,47,51,64,65,92,"]
[375,5,"22,47,63,28,"]
[385,0,"82,"]
[400,5,"8,9,12,22,23,28,29,32,44,47,56,31,"]
[430,5,"4,"]
[450,6,"10,11,13,14,15,16,22,23,12,28,29,37,46,47,53,31,51,1,"]
[475,0,"23,"]
[480,6,"12,22,28,29,32,47,1,"]
[500,0,"22,28,47,73,"]
[525,0,"22,"]
[535,7,"8,9,12,23,47,"]
[550,7,"10,11,"]
[600,8,"28,28,86,51,"]
[625,8,"8,9,12,13,"]
[630,8,"1,10,11,12,13,14,15,22,16,23,28,29,31,32,33,36,44,45,47,51,37,76,33,28,48,69,83,49,42,88,97,113,114,118,122,125,93,8,9,127,"]
[650,8,"28,"]
[675,9,"8,9,12,23,47,29,127,"]
[680,9,"123,"]
[750,10,"22,28,51,23,"]
[800,10,"8,9,10,11,12,13,14,15,16,33,36,28,47,49,93,104,112,23,"]
[825,0,"22,"]
[850,11,"22,28,29,51"]
[900,12,"8,9,10,11,22,23,28,29,41,47,121,51n"]
[1000,13,"3,9,8,10,11,12,13,14,15,22,23,16,28,29,31,32,33,40,42,43,47,49,60,69,48,85,88,49,93,98,51,105,110,24,"]
[1020,13,"31,47,"]
[1050,14,"22,28,28,69,"]
[1075,14,"22,49,"]
[1125,15,"8,9,23,"]
[1150,15,"28,38,32,"]
[1200,16,"22,59,69,51,"]
[1250,16,"22,28,47,58,49"]
[1275,17,"12,23,14,15,22,18,28,29,33,31,93,24,"]
[1425,0,"22,"]
[1500,20,"22,28,29,34,43,42,"]
[1600,21,"2,12,13,14,15,18,22,20,19,28,29,33,39,47,31,67,70,74,93,51,94,69,8,32,111,"]
[1675,25,"3,"]
[1800,0,"28,33,93,"]
[1900,25,"28,"]
[2000,26,"18,20,22,21,24,25,26,19,28,29,33,68,84,73,51,93,120,"]
[2500,33,"18,20,22,21,24,25,26,19,28,29,32,33,54,69,93,101,31,"]
[2625,35,"28,"]
[2800,0,"72,"]
[3000,40,"18,28,29,50,22,24,"]
[3300,42,"18,28,29,"]
[3750,0,"51,"]
[4000,53,"18,28,29,52,"]
[4500,60,"31,"]
[4730,63,"28,"]
[4800,0,"27,"]
[5000,0,"22,28,29,91,"]
[6000,0,"57,81,91,27,102,107,109,124,51,"]
[8000,0,"87,"]
[9300,0,"27,"]
[10000,0,"69,"]
[13500,0,"27,"]
[3500,46,"24,"]